BDBM50415092 CHEMBL570895
SMILES: Cc1c(Cl)c(ccc1N1[C@@H]2CC[C@@H]1CC(O)C2)C#N
InChI Key: InChIKey=KRPAAKPHVZQMIF-VXGBXAGGSA-N
Data: 1 EC50
Activity Spreadsheet -- Enzyme Inhibition Constant Data from BindingDB
Found 1 hit for monomerid = 50415092
Trg + Lig
Ki
nM
ΔG°
kcal/mole
IC50
nM
Kd
nM
EC50/IC50
nM
koff
s-1
kon
M-1s-1
pHTemp
°C
Androgen receptor
(Mus musculus)
BDBM50415092
(CHEMBL570895)
Show SMILES Cc1c(Cl)c(ccc1N1[C@@H]2CC[C@@H]1CC(O)C2)C#N |r,TLB:7:8:10.11:16.13.14,THB:15:14:8:10.11|
Show InChI InChI=1S/C15H17ClN2O/c1-9-14(5-2-10(8-17)15(9)16)18-11-3-4-12(18)7-13(19)6-11/h2,5,11-13,19H,3-4,6-7H2,1H3/t11-,12-/m1/s1
Reactome pathway
n/an/an/an/a 2n/an/an/an/a
ACADIA Pharmaceuticals AB
Curated by ChEMBL
Assay Description
Agonist activity at androgen receptor in mouse NIH3T3 cells transiently transfected with beta-galactosidase reporter gene assessed as cellular transf...
J Med Chem 52: 7186-91 (2009)
Article DOI: 10.1021/jm901149c
BindingDB Entry DOI: 10.7270/Q2SJ1MV9