null
SMILES: Clc1cccc(c1Cl)-c1ccc(cc1)N1CCOCC1
InChI Key: InChIKey=RHNBITCWWGCCCA-UHFFFAOYSA-N
Activity Spreadsheet -- Enzyme Inhibition Constant Data from BindingDB
Found 1 hit for monomerid = 50415302
Trg + Lig
Ki
nM
ΔG°
kcal/mole
IC50
nM
Kd
nM
EC50/IC50
nM
koff
s-1
kon
M-1s-1
pHTemp
°C
Cannabinoid receptor 2
(Homo sapiens (Human))
BDBM50415302
(CHEMBL608403)
Show SMILES Clc1cccc(c1Cl)-c1ccc(cc1)N1CCOCC1
Show InChI InChI=1S/C16H15Cl2NO/c17-15-3-1-2-14(16(15)18)12-4-6-13(7-5-12)19-8-10-20-11-9-19/h1-7H,8-11H2
Reactome pathway
n/an/an/an/a 39.8n/an/an/an/a
GlaxoSmithKline
Curated by ChEMBL
Assay Description
Agonist activity at human CB2 receptor
Bioorg Med Chem Lett 20: 465-8 (2010)
Article DOI: 10.1016/j.bmcl.2009.11.117
BindingDB Entry DOI: 10.7270/Q27M096D