null
SMILES: Clc1cccc(c1Cl)-c1ncc(cn1)N1CCOCC1
InChI Key: InChIKey=LJSJQJXVIWGJPS-UHFFFAOYSA-N
Activity Spreadsheet -- Enzyme Inhibition Constant Data from BindingDB
Found 1 hit for monomerid = 50415305
Trg + Lig
Ki
nM
ΔG°
kcal/mole
IC50
nM
Kd
nM
EC50/IC50
nM
koff
s-1
kon
M-1s-1
pHTemp
°C
Cannabinoid receptor 2
(Homo sapiens (Human))
BDBM50415305
(CHEMBL608992)
Show SMILES Clc1cccc(c1Cl)-c1ncc(cn1)N1CCOCC1
Show InChI InChI=1S/C14H13Cl2N3O/c15-12-3-1-2-11(13(12)16)14-17-8-10(9-18-14)19-4-6-20-7-5-19/h1-3,8-9H,4-7H2
Reactome pathway
n/an/an/an/a 50.1n/an/an/an/a
GlaxoSmithKline
Curated by ChEMBL
Assay Description
Agonist activity at human CB2 receptor
Bioorg Med Chem Lett 20: 465-8 (2010)
Article DOI: 10.1016/j.bmcl.2009.11.117
BindingDB Entry DOI: 10.7270/Q27M096D