null
SMILES: FC(F)(F)c1ccccc1-c1ccc(nn1)N1CCOCC1
InChI Key: InChIKey=MLIUFQYSJQPLPY-UHFFFAOYSA-N
Activity Spreadsheet -- Enzyme Inhibition Constant Data from BindingDB
Found 2 hits for monomerid = 50415317
Trg + Lig
Ki
nM
ΔG°
kcal/mole
IC50
nM
Kd
nM
EC50/IC50
nM
koff
s-1
kon
M-1s-1
pHTemp
°C
Cannabinoid receptor 1
(Homo sapiens (Human))
BDBM50415317
(CHEMBL593130)
Show SMILES FC(F)(F)c1ccccc1-c1ccc(nn1)N1CCOCC1
Show InChI InChI=1S/C15H14F3N3O/c16-15(17,18)12-4-2-1-3-11(12)13-5-6-14(20-19-13)21-7-9-22-10-8-21/h1-6H,7-10H2
NCI pathway
Reactome pathway
n/an/an/an/a>3.16E+4n/an/an/an/a
GlaxoSmithKline
Curated by ChEMBL
Assay Description
Agonist activity at human CB1 receptor
Bioorg Med Chem Lett 20: 465-8 (2010)
Article DOI: 10.1016/j.bmcl.2009.11.117
BindingDB Entry DOI: 10.7270/Q27M096D
Cannabinoid receptor 2
(Homo sapiens (Human))
BDBM50415317
(CHEMBL593130)
Show SMILES FC(F)(F)c1ccccc1-c1ccc(nn1)N1CCOCC1
Show InChI InChI=1S/C15H14F3N3O/c16-15(17,18)12-4-2-1-3-11(12)13-5-6-14(20-19-13)21-7-9-22-10-8-21/h1-6H,7-10H2
Reactome pathway
n/an/an/an/a 1.26E+3n/an/an/an/a
GlaxoSmithKline
Curated by ChEMBL
Assay Description
Agonist activity at human CB2 receptor
Bioorg Med Chem Lett 20: 465-8 (2010)
Article DOI: 10.1016/j.bmcl.2009.11.117
BindingDB Entry DOI: 10.7270/Q27M096D