null
SMILES: C[C@H]1CC[C@@H](C)N1c1ccc(nn1)-c1cncc2ccccc12
InChI Key: InChIKey=LAVIXOKYHRWFDZ-OKILXGFUSA-N
Activity Spreadsheet -- Enzyme Inhibition Constant Data from BindingDB
Found 2 hits for monomerid = 50415328
Trg + Lig
Ki
nM
ΔG°
kcal/mole
IC50
nM
Kd
nM
EC50/IC50
nM
koff
s-1
kon
M-1s-1
pHTemp
°C
Cannabinoid receptor 2
(Homo sapiens (Human))
BDBM50415328
(CHEMBL611620)
Show SMILES C[C@H]1CC[C@@H](C)N1c1ccc(nn1)-c1cncc2ccccc12 |r|
Show InChI InChI=1S/C19H20N4/c1-13-7-8-14(2)23(13)19-10-9-18(21-22-19)17-12-20-11-15-5-3-4-6-16(15)17/h3-6,9-14H,7-8H2,1-2H3/t13-,14+
Reactome pathway
n/an/an/an/a 10n/an/an/an/a
GlaxoSmithKline
Curated by ChEMBL
Assay Description
Agonist activity at human CB2 receptor
Bioorg Med Chem Lett 20: 465-8 (2010)
Article DOI: 10.1016/j.bmcl.2009.11.117
BindingDB Entry DOI: 10.7270/Q27M096D
Cannabinoid receptor 1
(Homo sapiens (Human))
BDBM50415328
(CHEMBL611620)
Show SMILES C[C@H]1CC[C@@H](C)N1c1ccc(nn1)-c1cncc2ccccc12 |r|
Show InChI InChI=1S/C19H20N4/c1-13-7-8-14(2)23(13)19-10-9-18(21-22-19)17-12-20-11-15-5-3-4-6-16(15)17/h3-6,9-14H,7-8H2,1-2H3/t13-,14+
NCI pathway
Reactome pathway
n/an/an/an/a 7.94E+3n/an/an/an/a
GlaxoSmithKline
Curated by ChEMBL
Assay Description
Agonist activity at human CB1 receptor
Bioorg Med Chem Lett 20: 465-8 (2010)
Article DOI: 10.1016/j.bmcl.2009.11.117
BindingDB Entry DOI: 10.7270/Q27M096D