BDBM50415545 CHEMBL597625
SMILES: COc1ccc(C(=O)\C=C\c2cccc(OCC#C)c2)c(OC)c1
InChI Key: InChIKey=DAIJPFJDWOBTFK-DHZHZOJOSA-N
Data: 1 IC50
Activity Spreadsheet -- Enzyme Inhibition Constant Data from BindingDB
Found 1 hit for monomerid = 50415545
Trg + Lig
Ki
nM
ΔG°
kcal/mole
IC50
nM
Kd
nM
EC50/IC50
nM
koff
s-1
kon
M-1s-1
pHTemp
°C
Falcipain-2
(Plasmodium falciparum)
BDBM50415545
(CHEMBL597625)
Show SMILES COc1ccc(C(=O)\C=C\c2cccc(OCC#C)c2)c(OC)c1
Show InChI InChI=1S/C20H18O4/c1-4-12-24-17-7-5-6-15(13-17)8-11-19(21)18-10-9-16(22-2)14-20(18)23-3/h1,5-11,13-14H,12H2,2-3H3/b11-8+
n/an/a>1.00E+5n/an/an/an/an/an/a
University of Cape Town
Curated by ChEMBL
Assay Description
Inhibition of Plasmodium falciparum falcipain-2
Bioorg Med Chem Lett 20: 942-4 (2010)
Article DOI: 10.1016/j.bmcl.2009.12.062
BindingDB Entry DOI: 10.7270/Q26M383G