BDBM50415619 CHEMBL1088632
SMILES: COc1cc2C(=NCCc2cc1Cl)c1ccccc1
InChI Key: InChIKey=LCJHNYJXBBYZIT-UHFFFAOYSA-N
Data: 2 IC50
Activity Spreadsheet -- Enzyme Inhibition Constant Data from BindingDB
Found 2 hits for monomerid = 50415619
Trg + Lig
Ki
nM
ΔG°
kcal/mole
IC50
nM
Kd
nM
EC50/IC50
nM
koff
s-1
kon
M-1s-1
pHTemp
°C
Mitogen-activated protein kinase 14
(Homo sapiens (Human))
BDBM50415619
(CHEMBL1088632)
Show SMILES COc1cc2C(=NCCc2cc1Cl)c1ccccc1 |c:5|
Show InChI InChI=1S/C16H14ClNO/c1-19-15-10-13-12(9-14(15)17)7-8-18-16(13)11-5-3-2-4-6-11/h2-6,9-10H,7-8H2,1H3
NCI pathway
Reactome pathway
n/an/a>1.58E+4n/an/an/an/an/an/a
GlaxoSmithKline R&D
Curated by ChEMBL
Assay Description
Inhibition of histidine-tagged human recombinant p38alpha after 120 mins by TR-FRET assay
Bioorg Med Chem Lett 19: 2230-4 (2009)
Article DOI: 10.1016/j.bmcl.2009.02.098
BindingDB Entry DOI: 10.7270/Q2Z320WR
Mitogen-activated protein kinase 10
(Homo sapiens (Human))
BDBM50415619
(CHEMBL1088632)
Show SMILES COc1cc2C(=NCCc2cc1Cl)c1ccccc1 |c:5|
Show InChI InChI=1S/C16H14ClNO/c1-19-15-10-13-12(9-14(15)17)7-8-18-16(13)11-5-3-2-4-6-11/h2-6,9-10H,7-8H2,1H3
NCI pathway
Reactome pathway
n/an/a>1.58E+4n/an/an/an/an/an/a
GlaxoSmithKline R&D
Curated by ChEMBL
Assay Description
Inhibition of N-terminal His(6)-tagged truncated human JNK3 transfected in baculovirus expression system by fluorescence anisotropy
Bioorg Med Chem Lett 19: 2230-4 (2009)
Article DOI: 10.1016/j.bmcl.2009.02.098
BindingDB Entry DOI: 10.7270/Q2Z320WR