BDBM50415888 CHEMBL1096314
SMILES: Cc1nn(c(C)c1CC(=O)NCc1ccc(F)cc1Cl)-c1ncccn1
InChI Key: InChIKey=YJGLYWQVHGTPSD-UHFFFAOYSA-N
Data: 2 IC50
Activity Spreadsheet -- Enzyme Inhibition Constant Data from BindingDB
Found 2 hits for monomerid = 50415888
Trg + Lig
Ki
nM
ΔG°
kcal/mole
IC50
nM
Kd
nM
EC50/IC50
nM
koff
s-1
kon
M-1s-1
pHTemp
°C
P2X purinoceptor 7
(Homo sapiens (Human))
BDBM50415888
(CHEMBL1096314)
Show SMILES Cc1nn(c(C)c1CC(=O)NCc1ccc(F)cc1Cl)-c1ncccn1
Show InChI InChI=1S/C18H17ClFN5O/c1-11-15(12(2)25(24-11)18-21-6-3-7-22-18)9-17(26)23-10-13-4-5-14(20)8-16(13)19/h3-8H,9-10H2,1-2H3,(H,23,26)
n/an/a 50n/an/an/an/an/an/a
Punjabi University
Curated by ChEMBL
Assay Description
Antagonist activity at P2X7 receptor (unknown origin)
Bioorg Med Chem 22: 54-88 (2014)
Article DOI: 10.1016/j.bmc.2013.10.054
BindingDB Entry DOI: 10.7270/Q27M0BX7
P2X purinoceptor 7
(Homo sapiens (Human))
BDBM50415888
(CHEMBL1096314)
Show SMILES Cc1nn(c(C)c1CC(=O)NCc1ccc(F)cc1Cl)-c1ncccn1
Show InChI InChI=1S/C18H17ClFN5O/c1-11-15(12(2)25(24-11)18-21-6-3-7-22-18)9-17(26)23-10-13-4-5-14(20)8-16(13)19/h3-8H,9-10H2,1-2H3,(H,23,26)
n/an/a 50.1n/an/an/an/an/an/a
GlaxoSmithKline
Curated by ChEMBL
Assay Description
Inhibition of human P2X7 receptor assessed as inhibition of ethidium bromide accumulation
Bioorg Med Chem Lett 20: 3161-4 (2010)
Article DOI: 10.1016/j.bmcl.2010.03.096
BindingDB Entry DOI: 10.7270/Q2W66N1B