null
SMILES: CN(c1ccccc1)S(=O)(=O)c1ccc(-c2ccc3n(ncc3c2)-c2ccc(F)cc2)c(c1)C(F)(F)F
InChI Key: InChIKey=NSEYQHXUJJGSKW-UHFFFAOYSA-N
Activity Spreadsheet -- Enzyme Inhibition Constant Data from BindingDB
Found 5 hits for monomerid = 50416078
Trg + Lig
Ki
nM
ΔG°
kcal/mole
IC50
nM
Kd
nM
EC50/IC50
nM
koff
s-1
kon
M-1s-1
pHTemp
°C
Glucocorticoid receptor
(Homo sapiens (Human))
BDBM50416078
(CHEMBL1083487)
Show SMILES CN(c1ccccc1)S(=O)(=O)c1ccc(-c2ccc3n(ncc3c2)-c2ccc(F)cc2)c(c1)C(F)(F)F
Show InChI InChI=1S/C27H19F4N3O2S/c1-33(21-5-3-2-4-6-21)37(35,36)23-12-13-24(25(16-23)27(29,30)31)18-7-14-26-19(15-18)17-32-34(26)22-10-8-20(28)9-11-22/h2-17H,1H3
n/an/a 12.6n/an/an/an/an/an/a
GlaxoSmithKline
Curated by ChEMBL
Assay Description
Displacement of fluorescent-labeled Dexamethasone from GR by fluorescent polarization assay
J Med Chem 53: 4531-44 (2010)
Article DOI: 10.1021/jm100447c
BindingDB Entry DOI: 10.7270/Q20003BB
Progesterone receptor
(Homo sapiens (Human))
BDBM50416078
(CHEMBL1083487)
Show SMILES CN(c1ccccc1)S(=O)(=O)c1ccc(-c2ccc3n(ncc3c2)-c2ccc(F)cc2)c(c1)C(F)(F)F
Show InChI InChI=1S/C27H19F4N3O2S/c1-33(21-5-3-2-4-6-21)37(35,36)23-12-13-24(25(16-23)27(29,30)31)18-7-14-26-19(15-18)17-32-34(26)22-10-8-20(28)9-11-22/h2-17H,1H3
n/an/a 794n/an/an/an/an/an/a
GlaxoSmithKline
Curated by ChEMBL
Assay Description
Binding affinity to PR
J Med Chem 53: 4531-44 (2010)
Article DOI: 10.1021/jm100447c
BindingDB Entry DOI: 10.7270/Q20003BB
Glucocorticoid receptor
(Homo sapiens (Human))
BDBM50416078
(CHEMBL1083487)
Show SMILES CN(c1ccccc1)S(=O)(=O)c1ccc(-c2ccc3n(ncc3c2)-c2ccc(F)cc2)c(c1)C(F)(F)F
Show InChI InChI=1S/C27H19F4N3O2S/c1-33(21-5-3-2-4-6-21)37(35,36)23-12-13-24(25(16-23)27(29,30)31)18-7-14-26-19(15-18)17-32-34(26)22-10-8-20(28)9-11-22/h2-17H,1H3
n/an/a 398n/an/an/an/an/an/a
GlaxoSmithKline
Curated by ChEMBL
Assay Description
Activity at GR in human A549 cells by NF-kappaB transrepression assay
J Med Chem 53: 4531-44 (2010)
Article DOI: 10.1021/jm100447c
BindingDB Entry DOI: 10.7270/Q20003BB
Glucocorticoid receptor
(Homo sapiens (Human))
BDBM50416078
(CHEMBL1083487)
Show SMILES CN(c1ccccc1)S(=O)(=O)c1ccc(-c2ccc3n(ncc3c2)-c2ccc(F)cc2)c(c1)C(F)(F)F
Show InChI InChI=1S/C27H19F4N3O2S/c1-33(21-5-3-2-4-6-21)37(35,36)23-12-13-24(25(16-23)27(29,30)31)18-7-14-26-19(15-18)17-32-34(26)22-10-8-20(28)9-11-22/h2-17H,1H3
n/an/an/an/a 631n/an/an/an/a
GlaxoSmithKline
Curated by ChEMBL
Assay Description
Agonist activity at GR in human A549 cells transfected with luciferase gene linked to MMTV promoter assessed as luciferase transactivation activity a...
J Med Chem 53: 4531-44 (2010)
Article DOI: 10.1021/jm100447c
BindingDB Entry DOI: 10.7270/Q20003BB
Androgen receptor
(Homo sapiens (Human))
BDBM50416078
(CHEMBL1083487)
Show SMILES CN(c1ccccc1)S(=O)(=O)c1ccc(-c2ccc3n(ncc3c2)-c2ccc(F)cc2)c(c1)C(F)(F)F
Show InChI InChI=1S/C27H19F4N3O2S/c1-33(21-5-3-2-4-6-21)37(35,36)23-12-13-24(25(16-23)27(29,30)31)18-7-14-26-19(15-18)17-32-34(26)22-10-8-20(28)9-11-22/h2-17H,1H3
NCI pathway
Reactome pathway
n/an/a>1.00E+4n/an/an/an/an/an/a
GlaxoSmithKline
Curated by ChEMBL
Assay Description
Binding affinity to AR
J Med Chem 53: 4531-44 (2010)
Article DOI: 10.1021/jm100447c
BindingDB Entry DOI: 10.7270/Q20003BB