null
SMILES: CC(C)NS(=O)(=O)c1ccc(-c2ccc3n(ncc3c2)-c2ccc(F)cc2)c(c1)C(F)(F)F
InChI Key: InChIKey=ZLLNZPHWDAFSSY-UHFFFAOYSA-N
Activity Spreadsheet -- Enzyme Inhibition Constant Data from BindingDB
Found 5 hits for monomerid = 50416085
Trg + Lig
Ki
nM
ΔG°
kcal/mole
IC50
nM
Kd
nM
EC50/IC50
nM
koff
s-1
kon
M-1s-1
pHTemp
°C
Androgen receptor
(Homo sapiens (Human))
BDBM50416085
(CHEMBL1082837)
Show SMILES CC(C)NS(=O)(=O)c1ccc(-c2ccc3n(ncc3c2)-c2ccc(F)cc2)c(c1)C(F)(F)F
Show InChI InChI=1S/C23H19F4N3O2S/c1-14(2)29-33(31,32)19-8-9-20(21(12-19)23(25,26)27)15-3-10-22-16(11-15)13-28-30(22)18-6-4-17(24)5-7-18/h3-14,29H,1-2H3
NCI pathway
Reactome pathway
n/an/a>1.00E+4n/an/an/an/an/an/a
GlaxoSmithKline
Curated by ChEMBL
Assay Description
Binding affinity to AR
J Med Chem 53: 4531-44 (2010)
Article DOI: 10.1021/jm100447c
BindingDB Entry DOI: 10.7270/Q20003BB
Glucocorticoid receptor
(Homo sapiens (Human))
BDBM50416085
(CHEMBL1082837)
Show SMILES CC(C)NS(=O)(=O)c1ccc(-c2ccc3n(ncc3c2)-c2ccc(F)cc2)c(c1)C(F)(F)F
Show InChI InChI=1S/C23H19F4N3O2S/c1-14(2)29-33(31,32)19-8-9-20(21(12-19)23(25,26)27)15-3-10-22-16(11-15)13-28-30(22)18-6-4-17(24)5-7-18/h3-14,29H,1-2H3
n/an/a>1.00E+4n/an/an/an/an/an/a
GlaxoSmithKline
Curated by ChEMBL
Assay Description
Activity at GR in human A549 cells by NF-kappaB transrepression assay
J Med Chem 53: 4531-44 (2010)
Article DOI: 10.1021/jm100447c
BindingDB Entry DOI: 10.7270/Q20003BB
Progesterone receptor
(Homo sapiens (Human))
BDBM50416085
(CHEMBL1082837)
Show SMILES CC(C)NS(=O)(=O)c1ccc(-c2ccc3n(ncc3c2)-c2ccc(F)cc2)c(c1)C(F)(F)F
Show InChI InChI=1S/C23H19F4N3O2S/c1-14(2)29-33(31,32)19-8-9-20(21(12-19)23(25,26)27)15-3-10-22-16(11-15)13-28-30(22)18-6-4-17(24)5-7-18/h3-14,29H,1-2H3
n/an/a 3.16E+3n/an/an/an/an/an/a
GlaxoSmithKline
Curated by ChEMBL
Assay Description
Binding affinity to PR
J Med Chem 53: 4531-44 (2010)
Article DOI: 10.1021/jm100447c
BindingDB Entry DOI: 10.7270/Q20003BB
Glucocorticoid receptor
(Homo sapiens (Human))
BDBM50416085
(CHEMBL1082837)
Show SMILES CC(C)NS(=O)(=O)c1ccc(-c2ccc3n(ncc3c2)-c2ccc(F)cc2)c(c1)C(F)(F)F
Show InChI InChI=1S/C23H19F4N3O2S/c1-14(2)29-33(31,32)19-8-9-20(21(12-19)23(25,26)27)15-3-10-22-16(11-15)13-28-30(22)18-6-4-17(24)5-7-18/h3-14,29H,1-2H3
n/an/a 1.26E+3n/an/an/an/an/an/a
GlaxoSmithKline
Curated by ChEMBL
Assay Description
Antagonist activity at GR in human A549 cells transfected with luciferase gene linked to MMTV promoter assessed as inhibition of dexamethasone-induce...
J Med Chem 53: 4531-44 (2010)
Article DOI: 10.1021/jm100447c
BindingDB Entry DOI: 10.7270/Q20003BB
Glucocorticoid receptor
(Homo sapiens (Human))
BDBM50416085
(CHEMBL1082837)
Show SMILES CC(C)NS(=O)(=O)c1ccc(-c2ccc3n(ncc3c2)-c2ccc(F)cc2)c(c1)C(F)(F)F
Show InChI InChI=1S/C23H19F4N3O2S/c1-14(2)29-33(31,32)19-8-9-20(21(12-19)23(25,26)27)15-3-10-22-16(11-15)13-28-30(22)18-6-4-17(24)5-7-18/h3-14,29H,1-2H3
n/an/a 12.6n/an/an/an/an/an/a
GlaxoSmithKline
Curated by ChEMBL
Assay Description
Displacement of fluorescent-labeled Dexamethasone from GR by fluorescent polarization assay
J Med Chem 53: 4531-44 (2010)
Article DOI: 10.1021/jm100447c
BindingDB Entry DOI: 10.7270/Q20003BB