BDBM50416384 CHEMBL1210504
SMILES: Cc1n[nH]c(C)c1CC(=O)NCc1ccc(Cl)cc1
InChI Key: InChIKey=FCYWYZZTAYYCEL-UHFFFAOYSA-N
Data: 1 IC50
Activity Spreadsheet -- Enzyme Inhibition Constant Data from BindingDB
Found 1 hit for monomerid = 50416384
Trg + Lig
Ki
nM
ΔG°
kcal/mole
IC50
nM
Kd
nM
EC50/IC50
nM
koff
s-1
kon
M-1s-1
pHTemp
°C
P2X purinoceptor 7
(Homo sapiens (Human))
BDBM50416384
(CHEMBL1210504)
Show SMILES Cc1n[nH]c(C)c1CC(=O)NCc1ccc(Cl)cc1
Show InChI InChI=1S/C14H16ClN3O/c1-9-13(10(2)18-17-9)7-14(19)16-8-11-3-5-12(15)6-4-11/h3-6H,7-8H2,1-2H3,(H,16,19)(H,17,18)
n/an/a 631n/an/an/an/an/an/a
GlaxoSmithKline
Curated by ChEMBL
Assay Description
Antagonist activity at human P2X7 receptor ethidium bromide release assay
Bioorg Med Chem Lett 20: 4653-6 (2010)
Article DOI: 10.1016/j.bmcl.2010.05.107
BindingDB Entry DOI: 10.7270/Q2DZ09HF