BDBM50416387 CHEMBL1210499
SMILES: Cc1cc(CCC(=O)NCc2ccc(F)cc2Cl)n(C)n1
InChI Key: InChIKey=IEOCQFNGSKTTLW-UHFFFAOYSA-N
Data: 1 IC50
Activity Spreadsheet -- Enzyme Inhibition Constant Data from BindingDB
Found 1 hit for monomerid = 50416387
Trg + Lig
Ki
nM
ΔG°
kcal/mole
IC50
nM
Kd
nM
EC50/IC50
nM
koff
s-1
kon
M-1s-1
pHTemp
°C
P2X purinoceptor 7
(Homo sapiens (Human))
BDBM50416387
(CHEMBL1210499)
Show SMILES Cc1cc(CCC(=O)NCc2ccc(F)cc2Cl)n(C)n1
Show InChI InChI=1S/C15H17ClFN3O/c1-10-7-13(20(2)19-10)5-6-15(21)18-9-11-3-4-12(17)8-14(11)16/h3-4,7-8H,5-6,9H2,1-2H3,(H,18,21)
n/an/a 316n/an/an/an/an/an/a
GlaxoSmithKline
Curated by ChEMBL
Assay Description
Antagonist activity at human P2X7 receptor ethidium bromide release assay
Bioorg Med Chem Lett 20: 4653-6 (2010)
Article DOI: 10.1016/j.bmcl.2010.05.107
BindingDB Entry DOI: 10.7270/Q2DZ09HF