BDBM50416409 CHEMBL1210702
SMILES: Fc1ccc(NC(=O)c2cc(c(s2)N2CCOCC2)-c2ccccc2)cc1
InChI Key: InChIKey=NYLTWGVNSKZTKS-UHFFFAOYSA-N
Data: 1 EC50
Activity Spreadsheet -- Enzyme Inhibition Constant Data from BindingDB
Found 1 hit for monomerid = 50416409
Trg + Lig
Ki
nM
ΔG°
kcal/mole
IC50
nM
Kd
nM
EC50/IC50
nM
koff
s-1
kon
M-1s-1
pHTemp
°C
Neuronal acetylcholine receptor protein alpha-7 subunit
(Homo sapiens (Human))
BDBM50416409
(CHEMBL1210702)
Show SMILES Fc1ccc(NC(=O)c2cc(c(s2)N2CCOCC2)-c2ccccc2)cc1
Show InChI InChI=1S/C21H19FN2O2S/c22-16-6-8-17(9-7-16)23-20(25)19-14-18(15-4-2-1-3-5-15)21(27-19)24-10-12-26-13-11-24/h1-9,14H,10-13H2,(H,23,25)
n/an/an/an/a 1.26E+3n/an/an/an/a
GlaxoSmithKline
Curated by ChEMBL
Assay Description
Positive allosteric modulator activity at human alpha7 nAChR expressed in rat GH4C1 assessed as calcium mobilization by FLIPR assay
Bioorg Med Chem Lett 20: 4561-5 (2010)
Article DOI: 10.1016/j.bmcl.2010.06.014
BindingDB Entry DOI: 10.7270/Q2959JSG