BDBM50416518 CHEMBL1214332::US9321743, URB867
SMILES: O=C(Cc1ccccc1)N[C@H]1COC1=O
InChI Key: InChIKey=SJFPLBXHHDXYOO-VIFPVBQESA-N
Data: 2 IC50
Activity Spreadsheet -- Enzyme Inhibition Constant Data from BindingDB
Found 2 hits for monomerid = 50416518
Trg + Lig
Ki
nM
ΔG°
kcal/mole
IC50
nM
Kd
nM
EC50/IC50
nM
koff
s-1
kon
M-1s-1
pHTemp
°C
N-acylethanolamine-hydrolyzing acid amidase
(Rattus norvegicus (Rat))
BDBM50416518
(CHEMBL1214332 | US9321743, URB867)
Show SMILES O=C(Cc1ccccc1)N[C@H]1COC1=O |r|
Show InChI InChI=1S/C11H11NO3/c13-10(12-9-7-15-11(9)14)6-8-4-2-1-3-5-8/h1-5,9H,6-7H2,(H,12,13)/t9-/m0/s1
n/an/a 1.85E+3n/an/an/an/an/an/a
University of California
Curated by ChEMBL
Assay Description
Inhibition of rat recombinant NAAA expressed in HEK293 cells after 30 mins
J Med Chem 53: 5770-81 (2010)
Article DOI: 10.1021/jm100582w
BindingDB Entry DOI: 10.7270/Q2X0689M
N-acylethanolamine-hydrolyzing acid amidase
(Rattus norvegicus (Rat))
BDBM50416518
(CHEMBL1214332 | US9321743, URB867)
Show SMILES O=C(Cc1ccccc1)N[C@H]1COC1=O |r|
Show InChI InChI=1S/C11H11NO3/c13-10(12-9-7-15-11(9)14)6-8-4-2-1-3-5-8/h1-5,9H,6-7H2,(H,12,13)/t9-/m0/s1
US Patent
n/an/a 1.85E+3n/an/an/an/a5.037
The Regents of the University of California; Universita Degli Studi Di Parma; Universita Degli Studi Di Urbino “Carlo Bo”
US Patent
Assay Description
Recombinant NAAA or native rat lung NAAA was incubated at 37 °C. for 30 min in 0.2 ml of sodium hydrogen phosphate buffer (50 mM, pH 5.0) contain...
US Patent US9321743 (2016)
BindingDB Entry DOI: 10.7270/Q26D5RVT