BDBM50416520 CHEMBL1214386::US9321743, URB864
SMILES: CCCCCCC(=O)N[C@H]1COC1=O
InChI Key: InChIKey=SNZBAKDOWBDCRQ-QMMMGPOBSA-N
Data: 2 IC50
Activity Spreadsheet -- Enzyme Inhibition Constant Data from BindingDB
Found 2 hits for monomerid = 50416520
Trg + Lig
Ki
nM
ΔG°
kcal/mole
IC50
nM
Kd
nM
EC50/IC50
nM
koff
s-1
kon
M-1s-1
pHTemp
°C
N-acylethanolamine-hydrolyzing acid amidase
(Rattus norvegicus (Rat))
BDBM50416520
(CHEMBL1214386 | US9321743, URB864)
Show SMILES CCCCCCC(=O)N[C@H]1COC1=O |r|
Show InChI InChI=1S/C10H17NO3/c1-2-3-4-5-6-9(12)11-8-7-14-10(8)13/h8H,2-7H2,1H3,(H,11,12)/t8-/m0/s1
n/an/a 460n/an/an/an/an/an/a
University of California
Curated by ChEMBL
Assay Description
Inhibition of rat recombinant NAAA expressed in HEK293 cells after 30 mins
J Med Chem 53: 5770-81 (2010)
Article DOI: 10.1021/jm100582w
BindingDB Entry DOI: 10.7270/Q2X0689M
N-acylethanolamine-hydrolyzing acid amidase
(Rattus norvegicus (Rat))
BDBM50416520
(CHEMBL1214386 | US9321743, URB864)
Show SMILES CCCCCCC(=O)N[C@H]1COC1=O |r|
Show InChI InChI=1S/C10H17NO3/c1-2-3-4-5-6-9(12)11-8-7-14-10(8)13/h8H,2-7H2,1H3,(H,11,12)/t8-/m0/s1
US Patent
n/an/a 460n/an/an/an/a5.037
The Regents of the University of California; Universita Degli Studi Di Parma; Universita Degli Studi Di Urbino “Carlo Bo”
US Patent
Assay Description
Recombinant NAAA or native rat lung NAAA was incubated at 37 °C. for 30 min in 0.2 ml of sodium hydrogen phosphate buffer (50 mM, pH 5.0) contain...
US Patent US9321743 (2016)
BindingDB Entry DOI: 10.7270/Q26D5RVT