BDBM50416526 CHEMBL1214392
SMILES: O=C(N[C@H]1CCOC1=O)c1ccc2ccccc2c1
InChI Key: InChIKey=CXIUUUJFUHKENY-ZDUSSCGKSA-N
Data: 1 IC50
Activity Spreadsheet -- Enzyme Inhibition Constant Data from BindingDB
Found 1 hit for monomerid = 50416526
Trg + Lig
Ki
nM
ΔG°
kcal/mole
IC50
nM
Kd
nM
EC50/IC50
nM
koff
s-1
kon
M-1s-1
pHTemp
°C
N-acylethanolamine-hydrolyzing acid amidase (NAAA)
(Rattus norvegicus (Rat))
BDBM50416526
(CHEMBL1214392)
Show SMILES O=C(N[C@H]1CCOC1=O)c1ccc2ccccc2c1 |r|
Show InChI InChI=1S/C15H13NO3/c17-14(16-13-7-8-19-15(13)18)12-6-5-10-3-1-2-4-11(10)9-12/h1-6,9,13H,7-8H2,(H,16,17)/t13-/m0/s1
n/an/a>1.00E+5n/an/an/an/an/an/a
University of California
Curated by ChEMBL
Assay Description
Inhibition of rat recombinant NAAA expressed in HEK293 cells after 30 mins
J Med Chem 53: 5770-81 (2010)
Article DOI: 10.1021/jm100582w
BindingDB Entry DOI: 10.7270/Q2X0689M