BDBM50417421 CHEMBL1290597
SMILES: CN1C(=O)CCc2c(CCN3CCN(CC3)c3cccc4nc(C)ccc34)c(C)ccc12
InChI Key: InChIKey=PDLXDQOODGXTSQ-UHFFFAOYSA-N
Data: 4 KI  1 EC50
Activity Spreadsheet -- Enzyme Inhibition Constant Data from BindingDB
Found 5 hits for monomerid = 50417421
Trg + Lig
Ki
nM
ΔG°
kcal/mole
IC50
nM
Kd
nM
EC50/IC50
nM
koff
s-1
kon
M-1s-1
pHTemp
°C
5-hydroxytryptamine receptor 1A
(Homo sapiens (Human))
BDBM50417421
(CHEMBL1290597)
Show SMILES CN1C(=O)CCc2c(CCN3CCN(CC3)c3cccc4nc(C)ccc34)c(C)ccc12
Show InChI InChI=1S/C27H32N4O/c1-19-7-11-25-22(10-12-27(32)29(25)3)21(19)13-14-30-15-17-31(18-16-30)26-6-4-5-24-23(26)9-8-20(2)28-24/h4-9,11H,10,12-18H2,1-3H3
0.631n/an/an/an/an/an/an/an/a
GlaxoSmithKline
Curated by ChEMBL
Assay Description
Antagonist activity at human 5-HT1A receptor expressed in HEK293 cells assessed as inhibition of GTPgammaS binding by scintillation proximity assay
Bioorg Med Chem Lett 20: 7092-6 (2010)
Article DOI: 10.1016/j.bmcl.2010.09.085
BindingDB Entry DOI: 10.7270/Q2MC919V
5-hydroxytryptamine receptor 1D
(Homo sapiens (Human))
BDBM50417421
(CHEMBL1290597)
Show SMILES CN1C(=O)CCc2c(CCN3CCN(CC3)c3cccc4nc(C)ccc34)c(C)ccc12
Show InChI InChI=1S/C27H32N4O/c1-19-7-11-25-22(10-12-27(32)29(25)3)21(19)13-14-30-15-17-31(18-16-30)26-6-4-5-24-23(26)9-8-20(2)28-24/h4-9,11H,10,12-18H2,1-3H3
Reactome pathway
1n/an/an/an/an/an/an/an/a
GlaxoSmithKline
Curated by ChEMBL
Assay Description
Antagonist activity at human 5-HT1D receptor expressed in CHO cells assessed as inhibition of GTPgammaS binding by scintillation proximity assay
Bioorg Med Chem Lett 20: 7092-6 (2010)
Article DOI: 10.1016/j.bmcl.2010.09.085
BindingDB Entry DOI: 10.7270/Q2MC919V
Sodium-dependent serotonin transporter
(Homo sapiens (Human))
BDBM50417421
(CHEMBL1290597)
Show SMILES CN1C(=O)CCc2c(CCN3CCN(CC3)c3cccc4nc(C)ccc34)c(C)ccc12
Show InChI InChI=1S/C27H32N4O/c1-19-7-11-25-22(10-12-27(32)29(25)3)21(19)13-14-30-15-17-31(18-16-30)26-6-4-5-24-23(26)9-8-20(2)28-24/h4-9,11H,10,12-18H2,1-3H3
25.1n/an/an/an/an/an/an/an/a
GlaxoSmithKline
Curated by ChEMBL
Assay Description
Displacement of [3H]-citalopram in human SERT expressed in LLCPK cells by filtration assay
Bioorg Med Chem Lett 20: 7092-6 (2010)
Article DOI: 10.1016/j.bmcl.2010.09.085
BindingDB Entry DOI: 10.7270/Q2MC919V
Transcriptional regulator ERG
(Homo sapiens (Human))
BDBM50417421
(CHEMBL1290597)
Show SMILES CN1C(=O)CCc2c(CCN3CCN(CC3)c3cccc4nc(C)ccc34)c(C)ccc12
Show InChI InChI=1S/C27H32N4O/c1-19-7-11-25-22(10-12-27(32)29(25)3)21(19)13-14-30-15-17-31(18-16-30)26-6-4-5-24-23(26)9-8-20(2)28-24/h4-9,11H,10,12-18H2,1-3H3
794n/an/an/an/an/an/an/an/a
GlaxoSmithKline
Curated by ChEMBL
Assay Description
Displacement of [3H]-dofetilide in human ERG expressed in CHO cells by proximity assay
Bioorg Med Chem Lett 20: 7092-6 (2010)
Article DOI: 10.1016/j.bmcl.2010.09.085
BindingDB Entry DOI: 10.7270/Q2MC919V
5-hydroxytryptamine receptor 1B
(Homo sapiens (Human))
BDBM50417421
(CHEMBL1290597)
Show SMILES CN1C(=O)CCc2c(CCN3CCN(CC3)c3cccc4nc(C)ccc34)c(C)ccc12
Show InChI InChI=1S/C27H32N4O/c1-19-7-11-25-22(10-12-27(32)29(25)3)21(19)13-14-30-15-17-31(18-16-30)26-6-4-5-24-23(26)9-8-20(2)28-24/h4-9,11H,10,12-18H2,1-3H3
Reactome pathway
n/an/an/an/a 398n/an/an/an/a
GlaxoSmithKline
Curated by ChEMBL
Assay Description
Agonist activity at human 5-HT1B receptor expressed in CHO cells assessed as stimulation of GTPgammaS binding by scintillation proximity assay
Bioorg Med Chem Lett 20: 7092-6 (2010)
Article DOI: 10.1016/j.bmcl.2010.09.085
BindingDB Entry DOI: 10.7270/Q2MC919V