BDBM50417677 CHEMBL1643364
SMILES: Nc1nccc2cc(CNCCc3ccncc3)ccc12
InChI Key: InChIKey=LDJUPDWUACBYOH-UHFFFAOYSA-N
Data: 1 IC50
Activity Spreadsheet -- Enzyme Inhibition Constant Data from BindingDB
Found 1 hit for monomerid = 50417677
Trg + Lig
Ki
nM
ΔG°
kcal/mole
IC50
nM
Kd
nM
EC50/IC50
nM
koff
s-1
kon
M-1s-1
pHTemp
°C
Rho-associated protein kinase 1
(Homo sapiens (Human))
BDBM50417677
(CHEMBL1643364)
Show SMILES Nc1nccc2cc(CNCCc3ccncc3)ccc12
Show InChI InChI=1S/C17H18N4/c18-17-16-2-1-14(11-15(16)6-10-21-17)12-20-9-5-13-3-7-19-8-4-13/h1-4,6-8,10-11,20H,5,9,12H2,(H2,18,21)
NCI pathway
Reactome pathway
n/an/a 1.86E+3n/an/an/an/an/an/a
MSD
Curated by ChEMBL
Assay Description
Inhibition of ROCK-1 by Immobilized metal ion affinity-based fluorescence polarization assay
Bioorg Med Chem Lett 21: 97-101 (2010)
Article DOI: 10.1016/j.bmcl.2010.11.060
BindingDB Entry DOI: 10.7270/Q29W0GQK