BDBM50417760 CHEMBL1644216
SMILES: COc1nc(NCCc2c(F)cccc2Cl)cc(n1)-c1cccc(C=O)c1
InChI Key: InChIKey=RADNMCGCMBSLHM-UHFFFAOYSA-N
Data: 1 IC50
Activity Spreadsheet -- Enzyme Inhibition Constant Data from BindingDB
Found 1 hit for monomerid = 50417760
Trg + Lig
Ki
nM
ΔG°
kcal/mole
IC50
nM
Kd
nM
EC50/IC50
nM
koff
s-1
kon
M-1s-1
pHTemp
°C
Prostanoid DP receptor
(Homo sapiens (Human))
BDBM50417760
(CHEMBL1644216)
Show SMILES COc1nc(NCCc2c(F)cccc2Cl)cc(n1)-c1cccc(C=O)c1
Show InChI InChI=1S/C20H17ClFN3O2/c1-27-20-24-18(14-5-2-4-13(10-14)12-26)11-19(25-20)23-9-8-15-16(21)6-3-7-17(15)22/h2-7,10-12H,8-9H2,1H3,(H,23,24,25)
n/an/a 3.63n/an/an/an/an/an/a
Sanofi Aventis US
Curated by ChEMBL
Assay Description
Antagonist activity at prostaglandin D2 receptor in human LS174T cells assessed as inhibition of PGD2-induced cAMP accumulation after 15 mins by scin...
Bioorg Med Chem Lett 21: 66-75 (2010)
Article DOI: 10.1016/j.bmcl.2010.11.071
BindingDB Entry DOI: 10.7270/Q22F7PPM