BDBM50417916 CHEMBL1668564::US8618114, 1.2.5(1)
SMILES: CNc1nn2c(C)cc(COC)nc2c1S(=O)(=O)c1ccccc1
InChI Key: InChIKey=AKYBXIOZAWNEGP-UHFFFAOYSA-N
Data: 1 KI  1 IC50
Activity Spreadsheet -- Enzyme Inhibition Constant Data from BindingDB
Found 2 hits for monomerid = 50417916
Trg + Lig
Ki
nM
ΔG°
kcal/mole
IC50
nM
Kd
nM
EC50/IC50
nM
koff
s-1
kon
M-1s-1
pHTemp
°C
5-hydroxytryptamine receptor 6
(Homo sapiens (Human))
BDBM50417916
(CHEMBL1668564 | US8618114, 1.2.5(1))
Show SMILES CNc1nn2c(C)cc(COC)nc2c1S(=O)(=O)c1ccccc1
Show InChI InChI=1S/C16H18N4O3S/c1-11-9-12(10-23-3)18-16-14(15(17-2)19-20(11)16)24(21,22)13-7-5-4-6-8-13/h4-9H,10H2,1-3H3,(H,17,19)
Reactome pathway
0.269n/an/an/an/an/an/an/an/a
Chemical Diversity Research Institute
Curated by ChEMBL
Assay Description
Antagonist activity at human recombinant 5HT6 receptor expressed in HEK293 cells assessed as inhibition of serotonin-induced cAMP accumulation after ...
Bioorg Med Chem 19: 1482-91 (2011)
Article DOI: 10.1016/j.bmc.2010.12.055
BindingDB Entry DOI: 10.7270/Q21G0NJS
5-hydroxytryptamine receptor 6
(Homo sapiens (Human))
BDBM50417916
(CHEMBL1668564 | US8618114, 1.2.5(1))
Show SMILES CNc1nn2c(C)cc(COC)nc2c1S(=O)(=O)c1ccccc1
Show InChI InChI=1S/C16H18N4O3S/c1-11-9-12(10-23-3)18-16-14(15(17-2)19-20(11)16)24(21,22)13-7-5-4-6-8-13/h4-9H,10H2,1-3H3,(H,17,19)
Reactome pathway
US Patent
n/an/a 4n/an/an/an/an/an/a
TBA
US Patent
Assay Description
Determination of antagonistic activity of compounds of the general formula 1 towards 5-HT6 receptors. Compounds of the general formula 1 were tested ...
US Patent US8618114 (2013)
BindingDB Entry DOI: 10.7270/Q2B56HD9