BDBM50418130 CHEMBL1760269
SMILES: CCCCN(c1cccc(c1C)-c1ccc(Cl)cc1)S(=O)(=O)c1ccc(OC(CC)C(O)=O)c(C)c1C
InChI Key: InChIKey=DBXQFQRUXGQRKN-UHFFFAOYSA-N
Data: 3 IC50  1 EC50
Activity Spreadsheet -- Enzyme Inhibition Constant Data from BindingDB
Found 4 hits for monomerid = 50418130
Trg + Lig
Ki
nM
ΔG°
kcal/mole
IC50
nM
Kd
nM
EC50/IC50
nM
koff
s-1
kon
M-1s-1
pHTemp
°C
Peroxisome proliferator-activated receptor
(Homo sapiens (Human))
BDBM50418130
(CHEMBL1760269)
Show SMILES CCCCN(c1cccc(c1C)-c1ccc(Cl)cc1)S(=O)(=O)c1ccc(OC(CC)C(O)=O)c(C)c1C
Show InChI InChI=1S/C29H34ClNO5S/c1-6-8-18-31(25-11-9-10-24(21(25)5)22-12-14-23(30)15-13-22)37(34,35)28-17-16-27(19(3)20(28)4)36-26(7-2)29(32)33/h9-17,26H,6-8,18H2,1-5H3,(H,32,33)
NCI pathway
Reactome pathway
n/an/a 5.01E+3n/an/an/an/an/an/a
GlaxoSmithKline Pharmaceuticals
Curated by ChEMBL
Assay Description
Displacement of [3H]GW 2433 from human PPARgamma by scintillation proximity assay
Bioorg Med Chem Lett 21: 2345-50 (2011)
Article DOI: 10.1016/j.bmcl.2011.02.077
BindingDB Entry DOI: 10.7270/Q2M61MHT
Peroxisome proliferator-activated receptor delta
(Homo sapiens (Human))
BDBM50418130
(CHEMBL1760269)
Show SMILES CCCCN(c1cccc(c1C)-c1ccc(Cl)cc1)S(=O)(=O)c1ccc(OC(CC)C(O)=O)c(C)c1C
Show InChI InChI=1S/C29H34ClNO5S/c1-6-8-18-31(25-11-9-10-24(21(25)5)22-12-14-23(30)15-13-22)37(34,35)28-17-16-27(19(3)20(28)4)36-26(7-2)29(32)33/h9-17,26H,6-8,18H2,1-5H3,(H,32,33)
n/an/an/an/a 126n/an/an/an/a
GlaxoSmithKline Pharmaceuticals
Curated by ChEMBL
Assay Description
Partial agonist activity at human PPARdelta expressed in african green monkey CV1 cells transfected with Gal4 assessed as beta-galactosidase activity...
Bioorg Med Chem Lett 21: 2345-50 (2011)
Article DOI: 10.1016/j.bmcl.2011.02.077
BindingDB Entry DOI: 10.7270/Q2M61MHT
Peroxisome proliferator-activated receptor delta
(Homo sapiens (Human))
BDBM50418130
(CHEMBL1760269)
Show SMILES CCCCN(c1cccc(c1C)-c1ccc(Cl)cc1)S(=O)(=O)c1ccc(OC(CC)C(O)=O)c(C)c1C
Show InChI InChI=1S/C29H34ClNO5S/c1-6-8-18-31(25-11-9-10-24(21(25)5)22-12-14-23(30)15-13-22)37(34,35)28-17-16-27(19(3)20(28)4)36-26(7-2)29(32)33/h9-17,26H,6-8,18H2,1-5H3,(H,32,33)
n/an/a 63n/an/an/an/an/an/a
GlaxoSmithKline Pharmaceuticals
Curated by ChEMBL
Assay Description
Displacement of [3H]GW 2433 from human PPARdelta by scintillation proximity assay
Bioorg Med Chem Lett 21: 2345-50 (2011)
Article DOI: 10.1016/j.bmcl.2011.02.077
BindingDB Entry DOI: 10.7270/Q2M61MHT
Peroxisome proliferator-activated receptor alpha (PPAR alpha)
(Homo sapiens (Human))
BDBM50418130
(CHEMBL1760269)
Show SMILES CCCCN(c1cccc(c1C)-c1ccc(Cl)cc1)S(=O)(=O)c1ccc(OC(CC)C(O)=O)c(C)c1C
Show InChI InChI=1S/C29H34ClNO5S/c1-6-8-18-31(25-11-9-10-24(21(25)5)22-12-14-23(30)15-13-22)37(34,35)28-17-16-27(19(3)20(28)4)36-26(7-2)29(32)33/h9-17,26H,6-8,18H2,1-5H3,(H,32,33)
n/an/a 1.58E+4n/an/an/an/an/an/a
GlaxoSmithKline Pharmaceuticals
Curated by ChEMBL
Assay Description
Displacement of [3H]GW 2433 from human PPARalpha by scintillation proximity assay
Bioorg Med Chem Lett 21: 2345-50 (2011)
Article DOI: 10.1016/j.bmcl.2011.02.077
BindingDB Entry DOI: 10.7270/Q2M61MHT