BDBM50418148 CHEMBL1760411
SMILES: CCCCN(c1cccc(c1Cl)-c1ccc(Cl)cc1)S(=O)(=O)c1ccc(OC(C)C(O)=O)c(C)c1C
InChI Key: InChIKey=FREIJBPNQYJDDY-UHFFFAOYSA-N
Data: 3 IC50  1 EC50
Activity Spreadsheet -- Enzyme Inhibition Constant Data from BindingDB
Found 4 hits for monomerid = 50418148
Trg + Lig
Ki
nM
ΔG°
kcal/mole
IC50
nM
Kd
nM
EC50/IC50
nM
koff
s-1
kon
M-1s-1
pHTemp
°C
Peroxisome proliferator-activated receptor
(Homo sapiens (Human))
BDBM50418148
(CHEMBL1760411)
Show SMILES CCCCN(c1cccc(c1Cl)-c1ccc(Cl)cc1)S(=O)(=O)c1ccc(OC(C)C(O)=O)c(C)c1C
Show InChI InChI=1S/C27H29Cl2NO5S/c1-5-6-16-30(23-9-7-8-22(26(23)29)20-10-12-21(28)13-11-20)36(33,34)25-15-14-24(17(2)18(25)3)35-19(4)27(31)32/h7-15,19H,5-6,16H2,1-4H3,(H,31,32)
NCI pathway
Reactome pathway
n/an/a 5.01E+3n/an/an/an/an/an/a
GlaxoSmithKline Pharmaceuticals
Curated by ChEMBL
Assay Description
Displacement of [3H]GW 2433 from human PPARgamma by scintillation proximity assay
Bioorg Med Chem Lett 21: 2345-50 (2011)
Article DOI: 10.1016/j.bmcl.2011.02.077
BindingDB Entry DOI: 10.7270/Q2M61MHT
Peroxisome proliferator-activated receptor delta
(Homo sapiens (Human))
BDBM50418148
(CHEMBL1760411)
Show SMILES CCCCN(c1cccc(c1Cl)-c1ccc(Cl)cc1)S(=O)(=O)c1ccc(OC(C)C(O)=O)c(C)c1C
Show InChI InChI=1S/C27H29Cl2NO5S/c1-5-6-16-30(23-9-7-8-22(26(23)29)20-10-12-21(28)13-11-20)36(33,34)25-15-14-24(17(2)18(25)3)35-19(4)27(31)32/h7-15,19H,5-6,16H2,1-4H3,(H,31,32)
n/an/a 7.90n/an/an/an/an/an/a
GlaxoSmithKline Pharmaceuticals
Curated by ChEMBL
Assay Description
Displacement of [3H]GW 2433 from human PPARdelta by scintillation proximity assay
Bioorg Med Chem Lett 21: 2345-50 (2011)
Article DOI: 10.1016/j.bmcl.2011.02.077
BindingDB Entry DOI: 10.7270/Q2M61MHT
Peroxisome proliferator-activated receptor delta
(Homo sapiens (Human))
BDBM50418148
(CHEMBL1760411)
Show SMILES CCCCN(c1cccc(c1Cl)-c1ccc(Cl)cc1)S(=O)(=O)c1ccc(OC(C)C(O)=O)c(C)c1C
Show InChI InChI=1S/C27H29Cl2NO5S/c1-5-6-16-30(23-9-7-8-22(26(23)29)20-10-12-21(28)13-11-20)36(33,34)25-15-14-24(17(2)18(25)3)35-19(4)27(31)32/h7-15,19H,5-6,16H2,1-4H3,(H,31,32)
n/an/an/an/a 10n/an/an/an/a
GlaxoSmithKline Pharmaceuticals
Curated by ChEMBL
Assay Description
Partial agonist activity at human PPARdelta expressed in african green monkey CV1 cells transfected with Gal4 assessed as beta-galactosidase activity...
Bioorg Med Chem Lett 21: 2345-50 (2011)
Article DOI: 10.1016/j.bmcl.2011.02.077
BindingDB Entry DOI: 10.7270/Q2M61MHT
Peroxisome proliferator-activated receptor alpha (PPAR alpha)
(Homo sapiens (Human))
BDBM50418148
(CHEMBL1760411)
Show SMILES CCCCN(c1cccc(c1Cl)-c1ccc(Cl)cc1)S(=O)(=O)c1ccc(OC(C)C(O)=O)c(C)c1C
Show InChI InChI=1S/C27H29Cl2NO5S/c1-5-6-16-30(23-9-7-8-22(26(23)29)20-10-12-21(28)13-11-20)36(33,34)25-15-14-24(17(2)18(25)3)35-19(4)27(31)32/h7-15,19H,5-6,16H2,1-4H3,(H,31,32)
n/an/a 1.26E+4n/an/an/an/an/an/a
GlaxoSmithKline Pharmaceuticals
Curated by ChEMBL
Assay Description
Displacement of [3H]GW 2433 from human PPARalpha by scintillation proximity assay
Bioorg Med Chem Lett 21: 2345-50 (2011)
Article DOI: 10.1016/j.bmcl.2011.02.077
BindingDB Entry DOI: 10.7270/Q2M61MHT