BDBM50418166 CHEMBL1761513
SMILES: CC(C)S(=O)(=O)N1CCC(CC1)c1c[nH]c2c(cc(cc12)-c1ccccc1)C(N)=O
InChI Key: InChIKey=OOGDWJHWYGKNPI-UHFFFAOYSA-N
Data: 3 IC50
Activity Spreadsheet -- Enzyme Inhibition Constant Data from BindingDB
Found 3 hits for monomerid = 50418166
Trg + Lig
Ki
nM
ΔG°
kcal/mole
IC50
nM
Kd
nM
EC50/IC50
nM
koff
s-1
kon
M-1s-1
pHTemp
°C
Inhibitor of nuclear factor kappa-B kinase subunit alpha
(Homo sapiens (Human))
BDBM50418166
(CHEMBL1761513)
Show SMILES CC(C)S(=O)(=O)N1CCC(CC1)c1c[nH]c2c(cc(cc12)-c1ccccc1)C(N)=O
Show InChI InChI=1S/C23H27N3O3S/c1-15(2)30(28,29)26-10-8-17(9-11-26)21-14-25-22-19(21)12-18(13-20(22)23(24)27)16-6-4-3-5-7-16/h3-7,12-15,17,25H,8-11H2,1-2H3,(H2,24,27)
Reactome pathway
n/an/a 3.16E+3n/an/an/an/an/an/a
GlaxoSmithKline R&D
Curated by ChEMBL
Assay Description
Inhibition of IKK-alpha
Bioorg Med Chem Lett 21: 2255-8 (2011)
Article DOI: 10.1016/j.bmcl.2011.02.107
BindingDB Entry DOI: 10.7270/Q2GF0VS3
Inhibitor of nuclear factor kappa-B kinase subunit beta
(Homo sapiens (Human))
BDBM50418166
(CHEMBL1761513)
Show SMILES CC(C)S(=O)(=O)N1CCC(CC1)c1c[nH]c2c(cc(cc12)-c1ccccc1)C(N)=O
Show InChI InChI=1S/C23H27N3O3S/c1-15(2)30(28,29)26-10-8-17(9-11-26)21-14-25-22-19(21)12-18(13-20(22)23(24)27)16-6-4-3-5-7-16/h3-7,12-15,17,25H,8-11H2,1-2H3,(H2,24,27)
NCI pathway
Reactome pathway
n/an/a 20n/an/an/an/an/an/a
China Pharmaceutical University
Curated by ChEMBL
Assay Description
Inhibition of human IKKbeta using GST-IkappaBalpha as substrate
Eur J Med Chem 63: 269-78 (2013)
Article DOI: 10.1016/j.ejmech.2013.01.045
BindingDB Entry DOI: 10.7270/Q2XG9SHG
Inhibitor of nuclear factor kappa-B kinase subunit beta
(Homo sapiens (Human))
BDBM50418166
(CHEMBL1761513)
Show SMILES CC(C)S(=O)(=O)N1CCC(CC1)c1c[nH]c2c(cc(cc12)-c1ccccc1)C(N)=O
Show InChI InChI=1S/C23H27N3O3S/c1-15(2)30(28,29)26-10-8-17(9-11-26)21-14-25-22-19(21)12-18(13-20(22)23(24)27)16-6-4-3-5-7-16/h3-7,12-15,17,25H,8-11H2,1-2H3,(H2,24,27)
NCI pathway
Reactome pathway
n/an/a 19.9n/an/an/an/an/an/a
GlaxoSmithKline R&D
Curated by ChEMBL
Assay Description
Inhibition of IKK-beta
Bioorg Med Chem Lett 21: 2255-8 (2011)
Article DOI: 10.1016/j.bmcl.2011.02.107
BindingDB Entry DOI: 10.7270/Q2GF0VS3