BDBM50418224 CHEMBL1760650
SMILES: COc1ccc(Br)cc1Cn1c(cc2cc(ccc12)C#N)C(=O)NCC(C)(C)CO
InChI Key: InChIKey=UTHASPYTZKMVCB-UHFFFAOYSA-N
Data: 1 IC50
Activity Spreadsheet -- Enzyme Inhibition Constant Data from BindingDB
Found 1 hit for monomerid = 50418224
Trg + Lig
Ki
nM
ΔG°
kcal/mole
IC50
nM
Kd
nM
EC50/IC50
nM
koff
s-1
kon
M-1s-1
pHTemp
°C
Cannabinoid receptor 1
(Homo sapiens (Human))
BDBM50418224
(CHEMBL1760650)
Show SMILES COc1ccc(Br)cc1Cn1c(cc2cc(ccc12)C#N)C(=O)NCC(C)(C)CO
Show InChI InChI=1S/C23H24BrN3O3/c1-23(2,14-28)13-26-22(29)20-10-16-8-15(11-25)4-6-19(16)27(20)12-17-9-18(24)5-7-21(17)30-3/h4-10,28H,12-14H2,1-3H3,(H,26,29)
NCI pathway
Reactome pathway
n/an/a 0.776n/an/an/an/an/an/a
MSD
Curated by ChEMBL
Assay Description
Antagonist activity against human CB1 receptor
Bioorg Med Chem Lett 21: 2034-9 (2011)
Article DOI: 10.1016/j.bmcl.2011.02.019
BindingDB Entry DOI: 10.7270/Q27082PM