BDBM50418232 CHEMBL1765762
SMILES: Nc1n[nH]c2cc(ccc12)-c1cc(NC2CCCC2)nc(N)n1
InChI Key: InChIKey=LDKHTALMQVJDPD-UHFFFAOYSA-N
Data: 5 IC50
Activity Spreadsheet -- Enzyme Inhibition Constant Data from BindingDB
Found 5 hits for monomerid = 50418232
Trg + Lig
Ki
nM
ΔG°
kcal/mole
IC50
nM
Kd
nM
EC50/IC50
nM
koff
s-1
kon
M-1s-1
pHTemp
°C
Aurora kinase B
(Homo sapiens (Human))
BDBM50418232
(CHEMBL1765762)
Show SMILES Nc1n[nH]c2cc(ccc12)-c1cc(NC2CCCC2)nc(N)n1
Show InChI InChI=1S/C16H19N7/c17-15-11-6-5-9(7-13(11)22-23-15)12-8-14(21-16(18)20-12)19-10-3-1-2-4-10/h5-8,10H,1-4H2,(H3,17,22,23)(H3,18,19,20,21)
Reactome pathway
n/an/a 7.94E+3n/an/an/an/an/an/a
GlaxoSmithKline
Curated by ChEMBL
Assay Description
Inhibition of aurora B
J Med Chem 54: 1871-95 (2011)
Article DOI: 10.1021/jm101527u
BindingDB Entry DOI: 10.7270/Q2HQ406Q
Rho-associated protein kinase 1
(Homo sapiens (Human))
BDBM50418232
(CHEMBL1765762)
Show SMILES Nc1n[nH]c2cc(ccc12)-c1cc(NC2CCCC2)nc(N)n1
Show InChI InChI=1S/C16H19N7/c17-15-11-6-5-9(7-13(11)22-23-15)12-8-14(21-16(18)20-12)19-10-3-1-2-4-10/h5-8,10H,1-4H2,(H3,17,22,23)(H3,18,19,20,21)
NCI pathway
Reactome pathway
n/an/a 6.31E+3n/an/an/an/an/an/a
GlaxoSmithKline
Curated by ChEMBL
Assay Description
Inhibition of ROCK1
J Med Chem 54: 1871-95 (2011)
Article DOI: 10.1021/jm101527u
BindingDB Entry DOI: 10.7270/Q2HQ406Q
TGF-beta receptor type-1
(Homo sapiens (Human))
BDBM50418232
(CHEMBL1765762)
Show SMILES Nc1n[nH]c2cc(ccc12)-c1cc(NC2CCCC2)nc(N)n1
Show InChI InChI=1S/C16H19N7/c17-15-11-6-5-9(7-13(11)22-23-15)12-8-14(21-16(18)20-12)19-10-3-1-2-4-10/h5-8,10H,1-4H2,(H3,17,22,23)(H3,18,19,20,21)
n/an/a 398n/an/an/an/an/an/a
GlaxoSmithKline
Curated by ChEMBL
Assay Description
Inhibition of ALK5
J Med Chem 54: 1871-95 (2011)
Article DOI: 10.1021/jm101527u
BindingDB Entry DOI: 10.7270/Q2HQ406Q
Aurora kinase A
(Homo sapiens (Human))
BDBM50418232
(CHEMBL1765762)
Show SMILES Nc1n[nH]c2cc(ccc12)-c1cc(NC2CCCC2)nc(N)n1
Show InChI InChI=1S/C16H19N7/c17-15-11-6-5-9(7-13(11)22-23-15)12-8-14(21-16(18)20-12)19-10-3-1-2-4-10/h5-8,10H,1-4H2,(H3,17,22,23)(H3,18,19,20,21)
NCI pathway
Reactome pathway
n/an/a 2.51E+3n/an/an/an/an/an/a
GlaxoSmithKline
Curated by ChEMBL
Assay Description
Inhibition of aurora A
J Med Chem 54: 1871-95 (2011)
Article DOI: 10.1021/jm101527u
BindingDB Entry DOI: 10.7270/Q2HQ406Q
3-phosphoinositide dependent protein kinase-1
(Homo sapiens (Human))
BDBM50418232
(CHEMBL1765762)
Show SMILES Nc1n[nH]c2cc(ccc12)-c1cc(NC2CCCC2)nc(N)n1
Show InChI InChI=1S/C16H19N7/c17-15-11-6-5-9(7-13(11)22-23-15)12-8-14(21-16(18)20-12)19-10-3-1-2-4-10/h5-8,10H,1-4H2,(H3,17,22,23)(H3,18,19,20,21)
NCI pathway
Reactome pathway
n/an/a 50n/an/an/an/an/an/a
GlaxoSmithKline
Curated by ChEMBL
Assay Description
Inhibition of PDK1-mediated AKT phosphorylation at Thr308 residue in human PC3 cells by ELISA
J Med Chem 54: 1871-95 (2011)
Article DOI: 10.1021/jm101527u
BindingDB Entry DOI: 10.7270/Q2HQ406Q