BDBM50418325 CHEMBL1765958
SMILES: CCCCCCC1=C(c2ccccc2)[C@@]2(CN(Cc3ccccc3)C[C@@H]2C1)C(=C)c1ccccc1
InChI Key: InChIKey=JFILKYCVXYKAKB-TWJUONSBSA-N
Data: 1 EC50
Activity Spreadsheet -- Enzyme Inhibition Constant Data from BindingDB
Found 1 hit for monomerid = 50418325
Trg + Lig
Ki
nM
ΔG°
kcal/mole
IC50
nM
Kd
nM
EC50/IC50
nM
koff
s-1
kon
M-1s-1
pHTemp
°C
Liver Receptor Homolog 1
(Homo sapiens (Human))
BDBM50418325
(CHEMBL1765958)
Show SMILES CCCCCCC1=C(c2ccccc2)[C@@]2(CN(Cc3ccccc3)C[C@@H]2C1)C(=C)c1ccccc1 |r,c:6|
Show InChI InChI=1S/C34H39N/c1-3-4-5-11-22-31-23-32-25-35(24-28-16-9-6-10-17-28)26-34(32,27(2)29-18-12-7-13-19-29)33(31)30-20-14-8-15-21-30/h6-10,12-21,32H,2-5,11,22-26H2,1H3/t32-,34-/m0/s1
Reactome pathway
n/an/an/an/a 316n/an/an/an/a
University of Southampton
Curated by ChEMBL
Assay Description
Agonist activity at human LRH-1 receptor assessed as TIF2 737-757 peptide recruitment by TR-FRET assay relative to control
J Med Chem 54: 2266-81 (2011)
Article DOI: 10.1021/jm1014296
BindingDB Entry DOI: 10.7270/Q29Z957P