null
SMILES: Cc1nc2cc(F)ccc2n1C1CC2CCC(C1)N2CCC1(CCN(CC1)C(=O)c1ccccc1)c1ccccc1
InChI Key: InChIKey=SGXJYRHEFMZKBV-UHFFFAOYSA-N
Activity Spreadsheet -- Enzyme Inhibition Constant Data from BindingDB
Found 1 hit for monomerid = 50418499
Trg + Lig
Ki
nM
ΔG°
kcal/mole
IC50
nM
Kd
nM
EC50/IC50
nM
koff
s-1
kon
M-1s-1
pHTemp
°C
C-C chemokine receptor type 5
(Homo sapiens (Human))
BDBM50418499
(CHEMBL1784400)
Show SMILES Cc1nc2cc(F)ccc2n1C1CC2CCC(C1)N2CCC1(CCN(CC1)C(=O)c1ccccc1)c1ccccc1
Show InChI InChI=1S/C35H39FN4O/c1-25-37-32-22-28(36)12-15-33(32)40(25)31-23-29-13-14-30(24-31)39(29)21-18-35(27-10-6-3-7-11-27)16-19-38(20-17-35)34(41)26-8-4-2-5-9-26/h2-12,15,22,29-31H,13-14,16-21,23-24H2,1H3
n/an/a 10n/an/an/an/an/an/a
GlaxoSmithKline
Curated by ChEMBL
Assay Description
Displacement of 125I-MIP-1beta from human CCR5 receptor after 4 hrs by scintillation counting
J Med Chem 54: 3756-67 (2011)
Article DOI: 10.1021/jm200279v
BindingDB Entry DOI: 10.7270/Q26111K7