BDBM50418553 CHEMBL1784701
SMILES: COC(=O)c1ccc2OCCN(c2c1)S(=O)(=O)c1ccc(C)cc1
InChI Key: InChIKey=MBCNWYWIPIQFSV-UHFFFAOYSA-N
Data: 1 EC50
Activity Spreadsheet -- Enzyme Inhibition Constant Data from BindingDB
Found 1 hit for monomerid = 50418553
Trg + Lig
Ki
nM
ΔG°
kcal/mole
IC50
nM
Kd
nM
EC50/IC50
nM
koff
s-1
kon
M-1s-1
pHTemp
°C
Cytochrome P450 2C9
(Homo sapiens (Human))
BDBM50418553
(CHEMBL1784701)
Show SMILES COC(=O)c1ccc2OCCN(c2c1)S(=O)(=O)c1ccc(C)cc1
Show InChI InChI=1S/C17H17NO5S/c1-12-3-6-14(7-4-12)24(20,21)18-9-10-23-16-8-5-13(11-15(16)18)17(19)22-2/h3-8,11H,9-10H2,1-2H3
Reactome pathway
n/an/an/an/a 3.98E+3n/an/an/an/a
Elara Pharmaceuticals GmbH
Curated by ChEMBL
Assay Description
Inhibition of CYP2C9 after 30 mins by luminescence assay
J Med Chem 54: 3982-6 (2011)
Article DOI: 10.1021/jm200272h
BindingDB Entry DOI: 10.7270/Q22808VH