BDBM50418604 CHEMBL1784170
SMILES: COCCNC(=O)c1ccc(cc1)-c1cc(cc(F)c1C)C(=O)NC1CC1
InChI Key: InChIKey=FTHCHPDGJBUELK-UHFFFAOYSA-N
Data: 1 KI  2 IC50
Activity Spreadsheet -- Enzyme Inhibition Constant Data from BindingDB
Found 3 hits for monomerid = 50418604
Trg + Lig
Ki
nM
ΔG°
kcal/mole
IC50
nM
Kd
nM
EC50/IC50
nM
koff
s-1
kon
M-1s-1
pHTemp
°C
Mitogen-activated protein kinase 14
(Homo sapiens (Human))
BDBM50418604
(CHEMBL1784170)
Show SMILES COCCNC(=O)c1ccc(cc1)-c1cc(cc(F)c1C)C(=O)NC1CC1
Show InChI InChI=1S/C21H23FN2O3/c1-13-18(11-16(12-19(13)22)21(26)24-17-7-8-17)14-3-5-15(6-4-14)20(25)23-9-10-27-2/h3-6,11-12,17H,7-10H2,1-2H3,(H,23,25)(H,24,26)
NCI pathway
Reactome pathway
12.6n/an/an/an/an/an/an/an/a
GlaxoSmithKline
Curated by ChEMBL
Assay Description
Inhibition of GST-tagged p38alpha by fluorescence polarization method
J Med Chem 52: 6257-69 (2009)
Article DOI: 10.1021/jm9004779
BindingDB Entry DOI: 10.7270/Q2J967NC
Cytochrome P450 2C9
(Homo sapiens (Human))
BDBM50418604
(CHEMBL1784170)
Show SMILES COCCNC(=O)c1ccc(cc1)-c1cc(cc(F)c1C)C(=O)NC1CC1
Show InChI InChI=1S/C21H23FN2O3/c1-13-18(11-16(12-19(13)22)21(26)24-17-7-8-17)14-3-5-15(6-4-14)20(25)23-9-10-27-2/h3-6,11-12,17H,7-10H2,1-2H3,(H,23,25)(H,24,26)
Reactome pathway
n/an/a 6.31E+4n/an/an/an/an/an/a
GlaxoSmithKline
Curated by ChEMBL
Assay Description
Inhibition of human CYP2C9 expressed in Escherichia coli by fluorimetric assay
J Med Chem 52: 6257-69 (2009)
Article DOI: 10.1021/jm9004779
BindingDB Entry DOI: 10.7270/Q2J967NC
Mitogen-activated protein kinase 14
(Homo sapiens (Human))
BDBM50418604
(CHEMBL1784170)
Show SMILES COCCNC(=O)c1ccc(cc1)-c1cc(cc(F)c1C)C(=O)NC1CC1
Show InChI InChI=1S/C21H23FN2O3/c1-13-18(11-16(12-19(13)22)21(26)24-17-7-8-17)14-3-5-15(6-4-14)20(25)23-9-10-27-2/h3-6,11-12,17H,7-10H2,1-2H3,(H,23,25)(H,24,26)
NCI pathway
Reactome pathway
n/an/a 316n/an/an/an/an/an/a
GlaxoSmithKline
Curated by ChEMBL
Assay Description
Inhibition of p38alpha-dependent TNFalpha production in human whole blood preincubated for 1 hr before LPS challenge by ELISA
J Med Chem 52: 6257-69 (2009)
Article DOI: 10.1021/jm9004779
BindingDB Entry DOI: 10.7270/Q2J967NC