BDBM50418795 CHEMBL1797398
SMILES: Cc1onc(c1NC(=O)OCc1c(F)cccc1Cl)-c1c(F)cccc1Cl
InChI Key: InChIKey=XNCIYKIAVOBLBC-UHFFFAOYSA-N
Data: 2 IC50
Activity Spreadsheet -- Enzyme Inhibition Constant Data from BindingDB
Found 2 hits for monomerid = 50418795
Trg + Lig
Ki
nM
ΔG°
kcal/mole
IC50
nM
Kd
nM
EC50/IC50
nM
koff
s-1
kon
M-1s-1
pHTemp
°C
Sodium channel protein type 5 subunit alpha
(Homo sapiens (Human))
BDBM50418795
(CHEMBL1797398)
Show SMILES Cc1onc(c1NC(=O)OCc1c(F)cccc1Cl)-c1c(F)cccc1Cl |(13.99,-37.25,;13.09,-38.5,;11.55,-38.5,;11.08,-39.97,;12.33,-40.88,;13.57,-39.96,;15.04,-40.43,;16.36,-39.64,;16.33,-38.1,;17.7,-40.38,;19.02,-39.59,;20.37,-40.34,;20.39,-41.88,;19.07,-42.67,;21.73,-42.62,;23.06,-41.83,;23.02,-40.28,;21.68,-39.54,;21.64,-38,;12.33,-42.42,;11,-43.19,;9.67,-42.42,;11,-44.73,;12.34,-45.51,;13.67,-44.73,;13.67,-43.18,;15,-42.41,)|
Show InChI InChI=1S/C18H12Cl2F2N2O3/c1-9-16(17(24-27-9)15-12(20)5-3-7-14(15)22)23-18(25)26-8-10-11(19)4-2-6-13(10)21/h2-7H,8H2,1H3,(H,23,25)
n/an/a>1.58E+4n/an/an/an/an/an/a
AstraZeneca
Curated by ChEMBL
Assay Description
Inhibition of Nav1.5 by cell based whole-cell voltage clamp electrophysiology assay
Bioorg Med Chem Lett 21: 3871-6 (2011)
Article DOI: 10.1016/j.bmcl.2011.05.041
BindingDB Entry DOI: 10.7270/Q21837RK
Sodium channel protein type 9 subunit alpha
(Homo sapiens (Human))
BDBM50418795
(CHEMBL1797398)
Show SMILES Cc1onc(c1NC(=O)OCc1c(F)cccc1Cl)-c1c(F)cccc1Cl |(13.99,-37.25,;13.09,-38.5,;11.55,-38.5,;11.08,-39.97,;12.33,-40.88,;13.57,-39.96,;15.04,-40.43,;16.36,-39.64,;16.33,-38.1,;17.7,-40.38,;19.02,-39.59,;20.37,-40.34,;20.39,-41.88,;19.07,-42.67,;21.73,-42.62,;23.06,-41.83,;23.02,-40.28,;21.68,-39.54,;21.64,-38,;12.33,-42.42,;11,-43.19,;9.67,-42.42,;11,-44.73,;12.34,-45.51,;13.67,-44.73,;13.67,-43.18,;15,-42.41,)|
Show InChI InChI=1S/C18H12Cl2F2N2O3/c1-9-16(17(24-27-9)15-12(20)5-3-7-14(15)22)23-18(25)26-8-10-11(19)4-2-6-13(10)21/h2-7H,8H2,1H3,(H,23,25)
n/an/a 72.4n/an/an/an/an/an/a
AstraZeneca
Curated by ChEMBL
Assay Description
Inhibition of Nav1.7 by cell based whole-cell voltage clamp electrophysiology assay
Bioorg Med Chem Lett 21: 3871-6 (2011)
Article DOI: 10.1016/j.bmcl.2011.05.041
BindingDB Entry DOI: 10.7270/Q21837RK