BDBM50418941 CHEMBL1807823
SMILES: O[C@@H](CNCCSCCCNCCc1ccccc1)c1ccc(O)c2[nH]c(=O)sc12
InChI Key: InChIKey=FMRMQJKRHKYSLD-IBGZPJMESA-N
Data: 2 IC50  1 EC50
Activity Spreadsheet -- Enzyme Inhibition Constant Data from BindingDB
Found 3 hits for monomerid = 50418941
Trg + Lig
Ki
nM
ΔG°
kcal/mole
IC50
nM
Kd
nM
EC50/IC50
nM
koff
s-1
kon
M-1s-1
pHTemp
°C
Beta-2 adrenergic receptor
(Homo sapiens (Human))
BDBM50418941
(CHEMBL1807823)
Show SMILES O[C@@H](CNCCSCCCNCCc1ccccc1)c1ccc(O)c2[nH]c(=O)sc12 |r|
Show InChI InChI=1S/C22H29N3O3S2/c26-18-8-7-17(21-20(18)25-22(28)30-21)19(27)15-24-12-14-29-13-4-10-23-11-9-16-5-2-1-3-6-16/h1-3,5-8,19,23-24,26-27H,4,9-15H2,(H,25,28)/t19-/m0/s1
Reactome pathway
n/an/an/an/a 0.794n/an/an/an/a
AstraZeneca
Curated by ChEMBL
Assay Description
Agonist activity at human adrenergic beta2 receptor expressed in H292 cells assessed as stimulation of cAMP accumulation after 60 mins
Bioorg Med Chem Lett 21: 4612-6 (2011)
Article DOI: 10.1016/j.bmcl.2011.05.097
BindingDB Entry DOI: 10.7270/Q2QV3NS2
Beta-1 adrenergic receptor
(Homo sapiens (Human))
BDBM50418941
(CHEMBL1807823)
Show SMILES O[C@@H](CNCCSCCCNCCc1ccccc1)c1ccc(O)c2[nH]c(=O)sc12 |r|
Show InChI InChI=1S/C22H29N3O3S2/c26-18-8-7-17(21-20(18)25-22(28)30-21)19(27)15-24-12-14-29-13-4-10-23-11-9-16-5-2-1-3-6-16/h1-3,5-8,19,23-24,26-27H,4,9-15H2,(H,25,28)/t19-/m0/s1
Reactome pathway
n/an/a 251n/an/an/an/an/an/a
AstraZeneca
Curated by ChEMBL
Assay Description
Binding affinity to adrenergic beta1 receptor
Bioorg Med Chem Lett 21: 4612-6 (2011)
Article DOI: 10.1016/j.bmcl.2011.05.097
BindingDB Entry DOI: 10.7270/Q2QV3NS2
D(2) dopamine receptor
(Homo sapiens (Human))
BDBM50418941
(CHEMBL1807823)
Show SMILES O[C@@H](CNCCSCCCNCCc1ccccc1)c1ccc(O)c2[nH]c(=O)sc12 |r|
Show InChI InChI=1S/C22H29N3O3S2/c26-18-8-7-17(21-20(18)25-22(28)30-21)19(27)15-24-12-14-29-13-4-10-23-11-9-16-5-2-1-3-6-16/h1-3,5-8,19,23-24,26-27H,4,9-15H2,(H,25,28)/t19-/m0/s1
Reactome pathway
n/an/a 3.98E+3n/an/an/an/an/an/a
AstraZeneca
Curated by ChEMBL
Assay Description
Binding affinity to dopamine 2 receptor
Bioorg Med Chem Lett 21: 4612-6 (2011)
Article DOI: 10.1016/j.bmcl.2011.05.097
BindingDB Entry DOI: 10.7270/Q2QV3NS2