BDBM50419076 CHEMBL1823889
SMILES: COc1ccccc1C(=O)NCC(N1CCN(C)CC1)c1ccc(C)cc1
InChI Key: InChIKey=DCDYUJVUWIMBKK-UHFFFAOYSA-N
Data: 2 IC50
Activity Spreadsheet -- Enzyme Inhibition Constant Data from BindingDB
Found 2 hits for monomerid = 50419076
Trg + Lig
Ki
nM
ΔG°
kcal/mole
IC50
nM
Kd
nM
EC50/IC50
nM
koff
s-1
kon
M-1s-1
pHTemp
°C
Potassium/sodium hyperpolarization-activated cyclic nucleotide-gated channel 4
(Homo sapiens (Human))
BDBM50419076
(CHEMBL1823889)
Show SMILES COc1ccccc1C(=O)NCC(N1CCN(C)CC1)c1ccc(C)cc1
Show InChI InChI=1S/C22H29N3O2/c1-17-8-10-18(11-9-17)20(25-14-12-24(2)13-15-25)16-23-22(26)19-6-4-5-7-21(19)27-3/h4-11,20H,12-16H2,1-3H3,(H,23,26)
Reactome pathway
n/an/a 2.00E+4n/an/an/an/an/an/a
Johnson& Johnson Pharmaceutical Research& Development
Curated by ChEMBL
Assay Description
Inhibition of human HCN4 heterologously expressed in HEK-293 cells after 30 mins by VIPR assay
Bioorg Med Chem Lett 21: 5197-201 (2011)
Article DOI: 10.1016/j.bmcl.2011.07.051
BindingDB Entry DOI: 10.7270/Q2PV6MNP
Potassium/sodium hyperpolarization-activated cyclic nucleotide-gated channel 1
(Homo sapiens (Human))
BDBM50419076
(CHEMBL1823889)
Show SMILES COc1ccccc1C(=O)NCC(N1CCN(C)CC1)c1ccc(C)cc1
Show InChI InChI=1S/C22H29N3O2/c1-17-8-10-18(11-9-17)20(25-14-12-24(2)13-15-25)16-23-22(26)19-6-4-5-7-21(19)27-3/h4-11,20H,12-16H2,1-3H3,(H,23,26)
Reactome pathway
n/an/a 2.51E+3n/an/an/an/an/an/a
Johnson& Johnson Pharmaceutical Research& Development
Curated by ChEMBL
Assay Description
Inhibition of human HCN1 heterologously expressed in HEK-293 cells after 30 mins by VIPR assay
Bioorg Med Chem Lett 21: 5197-201 (2011)
Article DOI: 10.1016/j.bmcl.2011.07.051
BindingDB Entry DOI: 10.7270/Q2PV6MNP