BDBM50419201 CHEMBL1836171
SMILES: CC(C)Oc1ccc(cc1C#N)-c1nc(no1)-c1ccc2CN(CC(=O)N[C@@H](C)CO)CCc2c1C
InChI Key: InChIKey=VTHJWDKDWWJBFE-KRWDZBQOSA-N
Data: 1 IC50  2 EC50
Activity Spreadsheet -- Enzyme Inhibition Constant Data from BindingDB
Found 3 hits for monomerid = 50419201
Trg + Lig
Ki
nM
ΔG°
kcal/mole
IC50
nM
Kd
nM
EC50/IC50
nM
koff
s-1
kon
M-1s-1
pHTemp
°C
Sphingosine 1-phosphate receptor 1
(Homo sapiens (Human))
BDBM50419201
(CHEMBL1836171)
Show SMILES CC(C)Oc1ccc(cc1C#N)-c1nc(no1)-c1ccc2CN(CC(=O)N[C@@H](C)CO)CCc2c1C |r|
Show InChI InChI=1S/C27H31N5O4/c1-16(2)35-24-8-6-19(11-21(24)12-28)27-30-26(31-36-27)23-7-5-20-13-32(10-9-22(20)18(23)4)14-25(34)29-17(3)15-33/h5-8,11,16-17,33H,9-10,13-15H2,1-4H3,(H,29,34)/t17-/m0/s1
Reactome pathway
n/an/an/an/a 1.26n/an/an/an/a
GlaxoSmithKline
Curated by ChEMBL
Assay Description
Agonist activity at human S1P1 receptor expressed in CHO-K1 EDG1 cells expressing beta-arrestin 2 after 105 mins by chemi-luminiscence assay
J Med Chem 54: 6724-33 (2011)
Article DOI: 10.1021/jm200609t
BindingDB Entry DOI: 10.7270/Q27P8ZSM
Sphingosine 1-phosphate receptor 3
(Homo sapiens (Human))
BDBM50419201
(CHEMBL1836171)
Show SMILES CC(C)Oc1ccc(cc1C#N)-c1nc(no1)-c1ccc2CN(CC(=O)N[C@@H](C)CO)CCc2c1C |r|
Show InChI InChI=1S/C27H31N5O4/c1-16(2)35-24-8-6-19(11-21(24)12-28)27-30-26(31-36-27)23-7-5-20-13-32(10-9-22(20)18(23)4)14-25(34)29-17(3)15-33/h5-8,11,16-17,33H,9-10,13-15H2,1-4H3,(H,29,34)/t17-/m0/s1
NCI pathway
Reactome pathway
n/an/an/an/a 2.51E+4n/an/an/an/a
GlaxoSmithKline
Curated by ChEMBL
Assay Description
Agonist activity at human S1P3 receptor expressed in RBL cells assessed as [35S]GTPgammaS binding after 3 hrs by radiometric assay
J Med Chem 54: 6724-33 (2011)
Article DOI: 10.1021/jm200609t
BindingDB Entry DOI: 10.7270/Q27P8ZSM
Potassium voltage-gated channel subfamily H member 2
(Homo sapiens (Human))
BDBM50419201
(CHEMBL1836171)
Show SMILES CC(C)Oc1ccc(cc1C#N)-c1nc(no1)-c1ccc2CN(CC(=O)N[C@@H](C)CO)CCc2c1C |r|
Show InChI InChI=1S/C27H31N5O4/c1-16(2)35-24-8-6-19(11-21(24)12-28)27-30-26(31-36-27)23-7-5-20-13-32(10-9-22(20)18(23)4)14-25(34)29-17(3)15-33/h5-8,11,16-17,33H,9-10,13-15H2,1-4H3,(H,29,34)/t17-/m0/s1
Reactome pathway
n/an/a>1.00E+4n/an/an/an/an/an/a
GlaxoSmithKline
Curated by ChEMBL
Assay Description
Inhibition of human ERG
J Med Chem 54: 6724-33 (2011)
Article DOI: 10.1021/jm200609t
BindingDB Entry DOI: 10.7270/Q27P8ZSM