BDBM50419381 CHEMBL1916284
SMILES: C[C@H](NC(=O)c1c(NS(=O)(=O)c2ccc(C)cc2)n(nc1C(F)(F)F)-c1ccccc1)C(C)(C)C
InChI Key: InChIKey=XILJXRVCHJZZBR-INIZCTEOSA-N
Data: 1 IC50
Activity Spreadsheet -- Enzyme Inhibition Constant Data from BindingDB
Found 1 hit for monomerid = 50419381
Trg + Lig
Ki
nM
ΔG°
kcal/mole
IC50
nM
Kd
nM
EC50/IC50
nM
koff
s-1
kon
M-1s-1
pHTemp
°C
fMet-Leu-Phe receptor
(Homo sapiens (Human))
BDBM50419381
(CHEMBL1916284)
Show SMILES C[C@H](NC(=O)c1c(NS(=O)(=O)c2ccc(C)cc2)n(nc1C(F)(F)F)-c1ccccc1)C(C)(C)C |r|
Show InChI InChI=1S/C24H27F3N4O3S/c1-15-11-13-18(14-12-15)35(33,34)30-21-19(22(32)28-16(2)23(3,4)5)20(24(25,26)27)29-31(21)17-9-7-6-8-10-17/h6-14,16,30H,1-5H3,(H,28,32)/t16-/m0/s1
Reactome pathway
n/an/a 25n/an/an/an/an/an/a
AstraZeneca
Curated by ChEMBL
Assay Description
Antagonist activity at human FPR1 in human neutrophils assessed as inhibition of fMLF-stimulated intracellular calcium mobilisation by FLIPR assay
Bioorg Med Chem Lett 21: 6456-60 (2011)
Article DOI: 10.1016/j.bmcl.2011.08.085
BindingDB Entry DOI: 10.7270/Q2WD41VZ