BDBM50419478 CHEMBL1921945
SMILES: C[C@@](N1CCCCC1)(C(=O)O[C@H]1C[N+]2(CC(=O)Nc3cccc(F)c3)CCC1CC2)c1cccs1
InChI Key: InChIKey=VZNXMVGDWIFGPG-PDGMAZNTSA-O
Data: 1 IC50
Activity Spreadsheet -- Enzyme Inhibition Constant Data from BindingDB
Found 1 hit for monomerid = 50419478
Trg + Lig
Ki
nM
ΔG°
kcal/mole
IC50
nM
Kd
nM
EC50/IC50
nM
koff
s-1
kon
M-1s-1
pHTemp
°C
Muscarinic acetylcholine receptor M3
(Homo sapiens (Human))
BDBM50419478
(CHEMBL1921945)
Show SMILES C[C@@](N1CCCCC1)(C(=O)O[C@H]1C[N+]2(CC(=O)Nc3cccc(F)c3)CCC1CC2)c1cccs1 |r,wU:1.0,wD:1.8,11.11,(43.88,2.13,;43.89,3.67,;43.89,5.22,;45.23,5.98,;45.23,7.53,;43.89,8.31,;42.55,7.53,;42.55,5.97,;45.24,2.9,;45.24,1.35,;46.57,3.68,;47.92,2.91,;47.92,1.36,;49.25,.6,;49.26,-.94,;50.6,-1.7,;50.61,-3.24,;51.93,-.92,;53.26,-1.68,;53.27,-3.22,;54.6,-3.98,;55.93,-3.2,;55.92,-1.65,;57.24,-.87,;54.58,-.9,;50.59,1.36,;50.59,2.91,;49.25,3.69,;48.47,2.36,;49.95,1.97,;42.65,2.76,;41.2,3.23,;40.3,1.99,;41.21,.75,;42.67,1.23,)|
Show InChI InChI=1S/C27H34FN3O3S/c1-27(24-9-6-16-35-24,30-12-3-2-4-13-30)26(33)34-23-18-31(14-10-20(23)11-15-31)19-25(32)29-22-8-5-7-21(28)17-22/h5-9,16-17,20,23H,2-4,10-15,18-19H2,1H3/p+1/t20?,23-,27-,31?/m0/s1
Reactome pathway
n/an/a 0.100n/an/an/an/an/an/a
AstraZeneca
Curated by ChEMBL
Assay Description
Displacement of [3H]NMS from recombinant human M3 receptor expressed in CHO-K1 cells after 16 hrs
Bioorg Med Chem Lett 21: 7440-6 (2011)
Article DOI: 10.1016/j.bmcl.2011.10.002
BindingDB Entry DOI: 10.7270/Q2H41SPH