BDBM50419567 CHEMBL1934416
SMILES: COCC(C)n1nc(C)c(C(=O)N[C@@H](C)C(C)(C)C)c1NS(=O)(=O)c1ccc(C)cc1
InChI Key: InChIKey=PRLQJMZZLUVWAX-LWKPJOBUSA-N
Data: 1 IC50
Activity Spreadsheet -- Enzyme Inhibition Constant Data from BindingDB
Found 1 hit for monomerid = 50419567
Trg + Lig
Ki
nM
ΔG°
kcal/mole
IC50
nM
Kd
nM
EC50/IC50
nM
koff
s-1
kon
M-1s-1
pHTemp
°C
fMet-Leu-Phe receptor
(Homo sapiens (Human))
BDBM50419567
(CHEMBL1934416)
Show SMILES COCC(C)n1nc(C)c(C(=O)N[C@@H](C)C(C)(C)C)c1NS(=O)(=O)c1ccc(C)cc1 |r|
Show InChI InChI=1S/C22H34N4O4S/c1-14-9-11-18(12-10-14)31(28,29)25-20-19(21(27)23-17(4)22(5,6)7)16(3)24-26(20)15(2)13-30-8/h9-12,15,17,25H,13H2,1-8H3,(H,23,27)/t15?,17-/m0/s1
Reactome pathway
n/an/a 2.51E+3n/an/an/an/an/an/a
AstraZeneca
Curated by ChEMBL
Assay Description
Antagonist activity at human recombinant FPR1 in expressed in HEK293 cells assessed as inhibition of FMLP-stimulated intracellular calcium mobilisati...
Bioorg Med Chem Lett 22: 532-6 (2011)
Article DOI: 10.1016/j.bmcl.2011.10.090
BindingDB Entry DOI: 10.7270/Q27P90NM