BDBM50419916 CHEMBL1956866
SMILES: CN1CC[N+]2(CC1)CCN(CC2)C(=O)C1(CCOCC1)NS(=O)(=O)c1ccc(Cl)c(COc2cccc3c(C)cc(C)nc23)c1Cl
InChI Key: InChIKey=SGMIXNIXHTVPCN-UHFFFAOYSA-N
Data: 2 KI  1 Kd
Activity Spreadsheet -- Enzyme Inhibition Constant Data from BindingDB
Found 3 hits for monomerid = 50419916
Trg + Lig
Ki
nM
ΔG°
kcal/mole
IC50
nM
Kd
nM
EC50/IC50
nM
koff
s-1
kon
M-1s-1
pHTemp
°C
BDKRB2
(Homo sapiens (Human))
BDBM50419916
(CHEMBL1956866)
Show SMILES CN1CC[N+]2(CC1)CCN(CC2)C(=O)C1(CCOCC1)NS(=O)(=O)c1ccc(Cl)c(COc2cccc3c(C)cc(C)nc23)c1Cl
Show InChI InChI=1S/C33H42Cl2N5O5S/c1-23-21-24(2)36-31-25(23)5-4-6-28(31)45-22-26-27(34)7-8-29(30(26)35)46(42,43)37-33(9-19-44-20-10-33)32(41)39-13-17-40(18-14-39)15-11-38(3)12-16-40/h4-8,21,37H,9-20,22H2,1-3H3/q+1
1n/an/an/an/an/an/an/an/a
Menarini Ricerche
Curated by ChEMBL
Assay Description
Displacement of [3H]-Bradykinin from human bradykinin B2 receptor expressed in CHO cells membrane after 60 mins by scintillation counting
Bioorg Med Chem 20: 2091-100 (2012)
Article DOI: 10.1016/j.bmc.2012.01.036
BindingDB Entry DOI: 10.7270/Q2PN96WX
Bradykinin B1 receptor
(Homo sapiens (Human))
BDBM50419916
(CHEMBL1956866)
Show SMILES CN1CC[N+]2(CC1)CCN(CC2)C(=O)C1(CCOCC1)NS(=O)(=O)c1ccc(Cl)c(COc2cccc3c(C)cc(C)nc23)c1Cl
Show InChI InChI=1S/C33H42Cl2N5O5S/c1-23-21-24(2)36-31-25(23)5-4-6-28(31)45-22-26-27(34)7-8-29(30(26)35)46(42,43)37-33(9-19-44-20-10-33)32(41)39-13-17-40(18-14-39)15-11-38(3)12-16-40/h4-8,21,37H,9-20,22H2,1-3H3/q+1
>1.00E+4n/an/an/an/an/an/an/an/a
Menarini Ricerche
Curated by ChEMBL
Assay Description
Displacement of [3H][desArg9]Lys-Bradykinin from human bradykinin B1 receptor expressed in CHO cells
Bioorg Med Chem 20: 2091-100 (2012)
Article DOI: 10.1016/j.bmc.2012.01.036
BindingDB Entry DOI: 10.7270/Q2PN96WX
BDKRB2
(Homo sapiens (Human))
BDBM50419916
(CHEMBL1956866)
Show SMILES CN1CC[N+]2(CC1)CCN(CC2)C(=O)C1(CCOCC1)NS(=O)(=O)c1ccc(Cl)c(COc2cccc3c(C)cc(C)nc23)c1Cl
Show InChI InChI=1S/C33H42Cl2N5O5S/c1-23-21-24(2)36-31-25(23)5-4-6-28(31)45-22-26-27(34)7-8-29(30(26)35)46(42,43)37-33(9-19-44-20-10-33)32(41)39-13-17-40(18-14-39)15-11-38(3)12-16-40/h4-8,21,37H,9-20,22H2,1-3H3/q+1
n/an/an/a 1.58n/an/an/an/an/a
Menarini Ricerche
Curated by ChEMBL
Assay Description
Antagonist activity at human bradykinin B2 receptor expressed in dhfr-deficient CHO cells assessed as inhibition of bradykinin-induced inositol monop...
Bioorg Med Chem 20: 2091-100 (2012)
Article DOI: 10.1016/j.bmc.2012.01.036
BindingDB Entry DOI: 10.7270/Q2PN96WX