BDBM50420011 CHEMBL2032302
SMILES: CC(C)Oc1ccc(cc1Cl)-c1nc2cc(CCCCC(O)=O)cnc2o1
InChI Key: InChIKey=KVYGLOPNGDNBCD-UHFFFAOYSA-N
Data: 2 EC50
Activity Spreadsheet -- Enzyme Inhibition Constant Data from BindingDB
Found 2 hits for monomerid = 50420011
Trg + Lig
Ki
nM
ΔG°
kcal/mole
IC50
nM
Kd
nM
EC50/IC50
nM
koff
s-1
kon
M-1s-1
pHTemp
°C
Sphingosine 1-phosphate receptor 1
(Homo sapiens (Human))
BDBM50420011
(CHEMBL2032302)
Show SMILES CC(C)Oc1ccc(cc1Cl)-c1nc2cc(CCCCC(O)=O)cnc2o1
Show InChI InChI=1S/C20H21ClN2O4/c1-12(2)26-17-8-7-14(10-15(17)21)19-23-16-9-13(11-22-20(16)27-19)5-3-4-6-18(24)25/h7-12H,3-6H2,1-2H3,(H,24,25)
Reactome pathway
n/an/an/an/a 158n/an/an/an/a
GlaxoSmithKline Pharmaceuticals
Curated by ChEMBL
Assay Description
Agonist activity at SIP1 receptor by tango assay
Bioorg Med Chem Lett 22: 3973-7 (2012)
Article DOI: 10.1016/j.bmcl.2012.04.095
BindingDB Entry DOI: 10.7270/Q29P32NS
Sphingosine 1-phosphate receptor 3
(Homo sapiens (Human))
BDBM50420011
(CHEMBL2032302)
Show SMILES CC(C)Oc1ccc(cc1Cl)-c1nc2cc(CCCCC(O)=O)cnc2o1
Show InChI InChI=1S/C20H21ClN2O4/c1-12(2)26-17-8-7-14(10-15(17)21)19-23-16-9-13(11-22-20(16)27-19)5-3-4-6-18(24)25/h7-12H,3-6H2,1-2H3,(H,24,25)
NCI pathway
Reactome pathway
n/an/an/an/a>1.00E+4n/an/an/an/a
GlaxoSmithKline Pharmaceuticals
Curated by ChEMBL
Assay Description
Agonist activity at human SIP3 receptor assessed as calcium mobilization by GeneBLAzer assay
Bioorg Med Chem Lett 22: 3973-7 (2012)
Article DOI: 10.1016/j.bmcl.2012.04.095
BindingDB Entry DOI: 10.7270/Q29P32NS