BDBM50420037 CHEMBL2032439
SMILES: OC(=O)C1CN(C1)c1ccc2oc(nc2c1)-c1ccc(-c2ccccc2)c(c1)C(F)(F)F
InChI Key: InChIKey=NBZBURQBPBZQBO-UHFFFAOYSA-N
Data: 2 EC50
Activity Spreadsheet -- Enzyme Inhibition Constant Data from BindingDB
Found 2 hits for monomerid = 50420037
Trg + Lig
Ki
nM
ΔG°
kcal/mole
IC50
nM
Kd
nM
EC50/IC50
nM
koff
s-1
kon
M-1s-1
pHTemp
°C
Sphingosine 1-phosphate receptor 1
(Homo sapiens (Human))
BDBM50420037
(CHEMBL2032439)
Show SMILES OC(=O)C1CN(C1)c1ccc2oc(nc2c1)-c1ccc(-c2ccccc2)c(c1)C(F)(F)F
Show InChI InChI=1S/C24H17F3N2O3/c25-24(26,27)19-10-15(6-8-18(19)14-4-2-1-3-5-14)22-28-20-11-17(7-9-21(20)32-22)29-12-16(13-29)23(30)31/h1-11,16H,12-13H2,(H,30,31)
Reactome pathway
n/an/an/an/a 10n/an/an/an/a
GlaxoSmithKline Pharmaceuticals
Curated by ChEMBL
Assay Description
Agonist activity at SIP1 receptor by tango assay
Bioorg Med Chem Lett 22: 3973-7 (2012)
Article DOI: 10.1016/j.bmcl.2012.04.095
BindingDB Entry DOI: 10.7270/Q29P32NS
Sphingosine 1-phosphate receptor 3
(Homo sapiens (Human))
BDBM50420037
(CHEMBL2032439)
Show SMILES OC(=O)C1CN(C1)c1ccc2oc(nc2c1)-c1ccc(-c2ccccc2)c(c1)C(F)(F)F
Show InChI InChI=1S/C24H17F3N2O3/c25-24(26,27)19-10-15(6-8-18(19)14-4-2-1-3-5-14)22-28-20-11-17(7-9-21(20)32-22)29-12-16(13-29)23(30)31/h1-11,16H,12-13H2,(H,30,31)
NCI pathway
Reactome pathway
n/an/an/an/a 2.00E+3n/an/an/an/a
GlaxoSmithKline Pharmaceuticals
Curated by ChEMBL
Assay Description
Agonist activity at human SIP3 receptor assessed as calcium mobilization by GeneBLAzer assay
Bioorg Med Chem Lett 22: 3973-7 (2012)
Article DOI: 10.1016/j.bmcl.2012.04.095
BindingDB Entry DOI: 10.7270/Q29P32NS