BDBM50420052 CHEMBL2046669
SMILES: Clc1ccc(cc1)C(=O)Nc1ccc(Cl)nc1
InChI Key: InChIKey=FOYOGIUAMYSVIT-UHFFFAOYSA-N
Data: 1 IC50  1 EC50
Activity Spreadsheet -- Enzyme Inhibition Constant Data from BindingDB
Found 2 hits for monomerid = 50420052
Trg + Lig
Ki
nM
ΔG°
kcal/mole
IC50
nM
Kd
nM
EC50/IC50
nM
koff
s-1
kon
M-1s-1
pHTemp
°C
Voltage-gated potassium channel beta subunit Mink/subunit Kv7.1
(Homo sapiens (Human))
BDBM50420052
(CHEMBL2046669)
Show SMILES Clc1ccc(cc1)C(=O)Nc1ccc(Cl)nc1
Show InChI InChI=1S/C12H8Cl2N2O/c13-9-3-1-8(2-4-9)12(17)16-10-5-6-11(14)15-7-10/h1-7H,(H,16,17)
n/an/a 1.50E+4n/an/an/an/an/an/a
TBA
Curated by ChEMBL
Assay Description
Antagonist activity at KCNQ1/MINK expressed in CHO cells assessed as inhibition of KCl-induced 86Rb+ efflux incubated for 10 mins prior to KCl-induct...
ACS Med Chem Lett 2: 481-484 (2011)
Article DOI: 10.1021/ml200053x
BindingDB Entry DOI: 10.7270/Q2R49RVJ
Voltage-gated potassium channel subunit Kv7.2/Kv7.3
(Homo sapiens (Human))
BDBM50420052
(CHEMBL2046669)
Show SMILES Clc1ccc(cc1)C(=O)Nc1ccc(Cl)nc1
Show InChI InChI=1S/C12H8Cl2N2O/c13-9-3-1-8(2-4-9)12(17)16-10-5-6-11(14)15-7-10/h1-7H,(H,16,17)
n/an/an/an/a 380n/an/an/an/a
TBA
Curated by ChEMBL
Assay Description
Agonist activity at KCNQ2/KCNQ3 expressed in CHO cells assessed as increase in KCl-induced 86Rb+ efflux incubated for 10 mins prior to KCl-induction ...
ACS Med Chem Lett 2: 481-484 (2011)
Article DOI: 10.1021/ml200053x
BindingDB Entry DOI: 10.7270/Q2R49RVJ