BDBM50420068 CHEMBL2047524
SMILES: Fc1cc(ccc1Cl)C(=O)Nc1cnc(Cl)nc1
InChI Key: InChIKey=GDLJBJHIRTYQIG-UHFFFAOYSA-N
Data: 1 IC50  1 EC50
Activity Spreadsheet -- Enzyme Inhibition Constant Data from BindingDB
Found 2 hits for monomerid = 50420068
Trg + Lig
Ki
nM
ΔG°
kcal/mole
IC50
nM
Kd
nM
EC50/IC50
nM
koff
s-1
kon
M-1s-1
pHTemp
°C
Potassium voltage-gated channel subfamily E/KQT member 1
(Homo sapiens (Human))
BDBM50420068
(CHEMBL2047524)
Show SMILES Fc1cc(ccc1Cl)C(=O)Nc1cnc(Cl)nc1
Show InChI InChI=1S/C11H6Cl2FN3O/c12-8-2-1-6(3-9(8)14)10(18)17-7-4-15-11(13)16-5-7/h1-5H,(H,17,18)
n/an/a 4.90E+4n/an/an/an/an/an/a
TBA
Curated by ChEMBL
Assay Description
Antagonist activity at KCNQ1/MINK expressed in CHO cells assessed as inhibition of KCl-induced 86Rb+ efflux incubated for 10 mins prior to KCl-induct...
ACS Med Chem Lett 2: 481-484 (2011)
Article DOI: 10.1021/ml200053x
BindingDB Entry DOI: 10.7270/Q2R49RVJ
Potassium voltage-gated channel subfamily KQT member 2/3
(Homo sapiens (Human))
BDBM50420068
(CHEMBL2047524)
Show SMILES Fc1cc(ccc1Cl)C(=O)Nc1cnc(Cl)nc1
Show InChI InChI=1S/C11H6Cl2FN3O/c12-8-2-1-6(3-9(8)14)10(18)17-7-4-15-11(13)16-5-7/h1-5H,(H,17,18)
n/an/an/an/a 410n/an/an/an/a
TBA
Curated by ChEMBL
Assay Description
Agonist activity at KCNQ2/KCNQ3 expressed in CHO cells assessed as increase in KCl-induced 86Rb+ efflux incubated for 10 mins prior to KCl-induction ...
ACS Med Chem Lett 2: 481-484 (2011)
Article DOI: 10.1021/ml200053x
BindingDB Entry DOI: 10.7270/Q2R49RVJ