null
SMILES: CCc1c(CCCC(O)=O)cccc1-c1ccc(nc1)-c1ccc(OC(C)C)c(c1)C#N
InChI Key: InChIKey=HXNNPYAGWJIBNA-UHFFFAOYSA-N
Activity Spreadsheet -- Enzyme Inhibition Constant Data from BindingDB
Found 1 hit for monomerid = 50420133
Trg + Lig
Ki
nM
ΔG°
kcal/mole
IC50
nM
Kd
nM
EC50/IC50
nM
koff
s-1
kon
M-1s-1
pHTemp
°C
Sphingosine 1-phosphate receptor 1
(Homo sapiens (Human))
BDBM50420133
(CHEMBL2059529)
Show SMILES CCc1c(CCCC(O)=O)cccc1-c1ccc(nc1)-c1ccc(OC(C)C)c(c1)C#N
Show InChI InChI=1S/C27H28N2O3/c1-4-23-19(8-6-10-27(30)31)7-5-9-24(23)21-11-13-25(29-17-21)20-12-14-26(32-18(2)3)22(15-20)16-28/h5,7,9,11-15,17-18H,4,6,8,10H2,1-3H3,(H,30,31)
Reactome pathway
n/an/an/an/a 31.6n/an/an/an/a
GlaxoSmithKline
Curated by ChEMBL
Assay Description
Agonist activity against S1P1 receptor by cell based FRET assay
J Med Chem 55: 4286-96 (2012)
Article DOI: 10.1021/jm2016107
BindingDB Entry DOI: 10.7270/Q2F190SQ