null
SMILES: COc1cc(OC)c2c(c1)oc(cc2=O)-c1cc(OC)c(OC)c(OC)c1
InChI Key: InChIKey=GIKVSFNAEBQLGB-UHFFFAOYSA-N
Activity Spreadsheet -- Enzyme Inhibition Constant Data from BindingDB
Found 1 hit for monomerid = 50420207
Trg + Lig
Ki
nM
ΔG°
kcal/mole
IC50
nM
Kd
nM
EC50/IC50
nM
koff
s-1
kon
M-1s-1
pHTemp
°C
ATP-dependent translocase ABCB1
(Homo sapiens (Human))
BDBM50420207
(CHEMBL2074901)
Show SMILES COc1cc(OC)c2c(c1)oc(cc2=O)-c1cc(OC)c(OC)c(OC)c1
Show InChI InChI=1S/C20H20O7/c1-22-12-8-15(23-2)19-13(21)10-14(27-16(19)9-12)11-6-17(24-3)20(26-5)18(7-11)25-4/h6-10H,1-5H3
n/an/a 400n/an/an/an/an/an/a
Chosun University
Curated by ChEMBL
Assay Description
TP_TRANSPORTER: drug resistance (vincristine) in AML-2/D100 cells
Biochem Biophys Res Commun 320: 672-9 (2004)
Article DOI: 10.1016/j.bbrc.2004.06.020
BindingDB Entry DOI: 10.7270/Q2891748