null
SMILES: COc1ccc2c(c1)oc(cc2=O)-c1ccc(OC)c(OC)c1
InChI Key: InChIKey=VSFZYCDPDWSYSS-UHFFFAOYSA-N
Activity Spreadsheet -- Enzyme Inhibition Constant Data from BindingDB
Found 1 hit for monomerid = 50420210
Trg + Lig
Ki
nM
ΔG°
kcal/mole
IC50
nM
Kd
nM
EC50/IC50
nM
koff
s-1
kon
M-1s-1
pHTemp
°C
ATP-dependent translocase ABCB1
(Homo sapiens (Human))
BDBM50420210
(CHEMBL13473)
Show SMILES COc1ccc2c(c1)oc(cc2=O)-c1ccc(OC)c(OC)c1
Show InChI InChI=1S/C18H16O5/c1-20-12-5-6-13-14(19)10-16(23-17(13)9-12)11-4-7-15(21-2)18(8-11)22-3/h4-10H,1-3H3
n/an/a 1.20E+3n/an/an/an/an/an/a
Chosun University
Curated by ChEMBL
Assay Description
TP_TRANSPORTER: drug resistance (vincristine) in AML-2/D100 cells
Biochem Biophys Res Commun 320: 672-9 (2004)
Article DOI: 10.1016/j.bbrc.2004.06.020
BindingDB Entry DOI: 10.7270/Q2891748