BDBM50420353 CHEMBL2089159
SMILES: CC(C)C[C@H](NC(=O)[C@@H](N)Cc1c[nH]c2ccccc12)C(=O)N[C@@H](Cc1ccc(O)cc1)C(N)=O
InChI Key: InChIKey=GGFDLHMXTGWZKG-PMVMPFDFSA-N
Data: 1 IC50
Activity Spreadsheet -- Enzyme Inhibition Constant Data from BindingDB
Found 1 hit for monomerid = 50420353
Trg + Lig
Ki
nM
ΔG°
kcal/mole
IC50
nM
Kd
nM
EC50/IC50
nM
koff
s-1
kon
M-1s-1
pHTemp
°C
Snake venom metalloproteinase Bap1
(Bothrops asper)
BDBM50420353
(CHEMBL2089159)
Show SMILES CC(C)C[C@H](NC(=O)[C@@H](N)Cc1c[nH]c2ccccc12)C(=O)N[C@@H](Cc1ccc(O)cc1)C(N)=O |r|
Show InChI InChI=1S/C26H33N5O4/c1-15(2)11-23(26(35)30-22(24(28)33)12-16-7-9-18(32)10-8-16)31-25(34)20(27)13-17-14-29-21-6-4-3-5-19(17)21/h3-10,14-15,20,22-23,29,32H,11-13,27H2,1-2H3,(H2,28,33)(H,30,35)(H,31,34)/t20-,22-,23-/m0/s1
n/an/a 4.02E+5n/an/an/an/an/an/a
TBA
Curated by ChEMBL
Assay Description
Inhibition of snake venom BaP1 using Abz-Ala-Gly-Leu-Ala-Nba as substrate incubated for 30 mins prior to substrate addition by fluorescence spectroph...
ACS Med Chem Lett 3: 540-543 (2012)
Article DOI: 10.1021/ml300068r
BindingDB Entry DOI: 10.7270/Q2542PVS