null
SMILES: NC(=O)[C@@H]1CCCN1C(=O)CCNC(=O)c1ccc(F)cc1
InChI Key: InChIKey=YAMBPZOWASLRED-LBPRGKRZSA-N
Activity Spreadsheet -- Enzyme Inhibition Constant Data from BindingDB
Found 1 hit for monomerid = 50420631
Trg + Lig
Ki
nM
ΔG°
kcal/mole
IC50
nM
Kd
nM
EC50/IC50
nM
koff
s-1
kon
M-1s-1
pHTemp
°C
Dipeptidyl peptidase 4
(Homo sapiens (Human))
BDBM50420631
(CHEMBL2086590)
Show SMILES NC(=O)[C@@H]1CCCN1C(=O)CCNC(=O)c1ccc(F)cc1 |r|
Show InChI InChI=1S/C15H18FN3O3/c16-11-5-3-10(4-6-11)15(22)18-8-7-13(20)19-9-1-2-12(19)14(17)21/h3-6,12H,1-2,7-9H2,(H2,17,21)(H,18,22)/t12-/m0/s1
Reactome pathway
n/an/a 93n/an/an/an/an/an/a
Zydus Research Centre
Curated by ChEMBL
Assay Description
Inhibition of human DPP4 expressed in baculovirus expression system using Gly-Pro-AMC substrate incubated or 30 mins by fluorescence based assay
Bioorg Med Chem Lett 22: 3516-21 (2012)
Article DOI: 10.1016/j.bmcl.2012.03.078
BindingDB Entry DOI: 10.7270/Q2QZ2C77