null
SMILES: FC(F)(F)c1ccc(cc1)C(=O)NCCCC(=O)N1CCC[C@H]1C#N
InChI Key: InChIKey=KWGXYCJEZYYYBT-AWEZNQCLSA-N
Activity Spreadsheet -- Enzyme Inhibition Constant Data from BindingDB
Found 1 hit for monomerid = 50420653
Trg + Lig
Ki
nM
ΔG°
kcal/mole
IC50
nM
Kd
nM
EC50/IC50
nM
koff
s-1
kon
M-1s-1
pHTemp
°C
Dipeptidyl peptidase 4
(Homo sapiens (Human))
BDBM50420653
(CHEMBL2086614)
Show SMILES FC(F)(F)c1ccc(cc1)C(=O)NCCCC(=O)N1CCC[C@H]1C#N |r|
Show InChI InChI=1S/C17H18F3N3O2/c18-17(19,20)13-7-5-12(6-8-13)16(25)22-9-1-4-15(24)23-10-2-3-14(23)11-21/h5-8,14H,1-4,9-10H2,(H,22,25)/t14-/m0/s1
Reactome pathway
n/an/a 3.80n/an/an/an/an/an/a
Zydus Research Centre
Curated by ChEMBL
Assay Description
Inhibition of human DPP4 expressed in baculovirus expression system using Gly-Pro-AMC substrate incubated or 30 mins by fluorescence based assay
Bioorg Med Chem Lett 22: 3516-21 (2012)
Article DOI: 10.1016/j.bmcl.2012.03.078
BindingDB Entry DOI: 10.7270/Q2QZ2C77