null
SMILES: CC(C)c1nc(no1)N1CCN([C@H](C)C1)c1ncc(OCc2ccncc2C#N)cn1
InChI Key: InChIKey=UNGZTVLHLKAKQE-OAHLLOKOSA-N
Activity Spreadsheet -- Enzyme Inhibition Constant Data from BindingDB
Found 12 hits for monomerid = 50420836
Trg + Lig
Ki
nM
ΔG°
kcal/mole
IC50
nM
Kd
nM
EC50/IC50
nM
koff
s-1
kon
M-1s-1
pHTemp
°C
Glucose-dependent insulinotropic receptor
(Homo sapiens (Human))
BDBM50420836
(CHEMBL2086690)
Show SMILES CC(C)c1nc(no1)N1CCN([C@H](C)C1)c1ncc(OCc2ccncc2C#N)cn1 |r|
Show InChI InChI=1S/C21H24N8O2/c1-14(2)19-26-21(27-31-19)28-6-7-29(15(3)12-28)20-24-10-18(11-25-20)30-13-16-4-5-23-9-17(16)8-22/h4-5,9-11,14-15H,6-7,12-13H2,1-3H3/t15-/m1/s1
n/an/an/an/a 8n/an/an/an/a
AstraZeneca
Curated by ChEMBL
Assay Description
Agonist activity at human GPR119 receptor over expressed in HEK293S cells assessed as increase in cAMP level after 45 mins by HTRF assay
J Med Chem 55: 5361-79 (2012)
Article DOI: 10.1021/jm300310c
BindingDB Entry DOI: 10.7270/Q2PZ5B3V
Cytochrome P450 3A4
(Homo sapiens (Human))
BDBM50420836
(CHEMBL2086690)
Show SMILES CC(C)c1nc(no1)N1CCN([C@H](C)C1)c1ncc(OCc2ccncc2C#N)cn1 |r|
Show InChI InChI=1S/C21H24N8O2/c1-14(2)19-26-21(27-31-19)28-6-7-29(15(3)12-28)20-24-10-18(11-25-20)30-13-16-4-5-23-9-17(16)8-22/h4-5,9-11,14-15H,6-7,12-13H2,1-3H3/t15-/m1/s1
Reactome pathway
n/an/a>3.00E+4n/an/an/an/an/an/a
AstraZeneca
Curated by ChEMBL
Assay Description
Inhibition of CYP3A4 by high-throughput fluorescence assay
J Med Chem 55: 5361-79 (2012)
Article DOI: 10.1021/jm300310c
BindingDB Entry DOI: 10.7270/Q2PZ5B3V
Cytochrome P450 2D6
(Homo sapiens (Human))
BDBM50420836
(CHEMBL2086690)
Show SMILES CC(C)c1nc(no1)N1CCN([C@H](C)C1)c1ncc(OCc2ccncc2C#N)cn1 |r|
Show InChI InChI=1S/C21H24N8O2/c1-14(2)19-26-21(27-31-19)28-6-7-29(15(3)12-28)20-24-10-18(11-25-20)30-13-16-4-5-23-9-17(16)8-22/h4-5,9-11,14-15H,6-7,12-13H2,1-3H3/t15-/m1/s1
n/an/a>3.00E+4n/an/an/an/an/an/a
AstraZeneca
Curated by ChEMBL
Assay Description
Inhibition of CYP2D6 by high-throughput fluorescence assay
J Med Chem 55: 5361-79 (2012)
Article DOI: 10.1021/jm300310c
BindingDB Entry DOI: 10.7270/Q2PZ5B3V
Cytochrome P450 2C19
(Homo sapiens (Human))
BDBM50420836
(CHEMBL2086690)
Show SMILES CC(C)c1nc(no1)N1CCN([C@H](C)C1)c1ncc(OCc2ccncc2C#N)cn1 |r|
Show InChI InChI=1S/C21H24N8O2/c1-14(2)19-26-21(27-31-19)28-6-7-29(15(3)12-28)20-24-10-18(11-25-20)30-13-16-4-5-23-9-17(16)8-22/h4-5,9-11,14-15H,6-7,12-13H2,1-3H3/t15-/m1/s1
Reactome pathway
n/an/a>3.00E+4n/an/an/an/an/an/a
AstraZeneca
Curated by ChEMBL
Assay Description
Inhibition of CYP2C19 by high-throughput fluorescence assay
J Med Chem 55: 5361-79 (2012)
Article DOI: 10.1021/jm300310c
BindingDB Entry DOI: 10.7270/Q2PZ5B3V
Cytochrome P450 2C9
(Homo sapiens (Human))
BDBM50420836
(CHEMBL2086690)
Show SMILES CC(C)c1nc(no1)N1CCN([C@H](C)C1)c1ncc(OCc2ccncc2C#N)cn1 |r|
Show InChI InChI=1S/C21H24N8O2/c1-14(2)19-26-21(27-31-19)28-6-7-29(15(3)12-28)20-24-10-18(11-25-20)30-13-16-4-5-23-9-17(16)8-22/h4-5,9-11,14-15H,6-7,12-13H2,1-3H3/t15-/m1/s1
Reactome pathway
n/an/a>3.00E+4n/an/an/an/an/an/a
AstraZeneca
Curated by ChEMBL
Assay Description
Inhibition of CYP2C9 by high-throughput fluorescence assay
J Med Chem 55: 5361-79 (2012)
Article DOI: 10.1021/jm300310c
BindingDB Entry DOI: 10.7270/Q2PZ5B3V
Glucose-dependent insulinotropic receptor
(Homo sapiens (Human))
BDBM50420836
(CHEMBL2086690)
Show SMILES CC(C)c1nc(no1)N1CCN([C@H](C)C1)c1ncc(OCc2ccncc2C#N)cn1 |r|
Show InChI InChI=1S/C21H24N8O2/c1-14(2)19-26-21(27-31-19)28-6-7-29(15(3)12-28)20-24-10-18(11-25-20)30-13-16-4-5-23-9-17(16)8-22/h4-5,9-11,14-15H,6-7,12-13H2,1-3H3/t15-/m1/s1
n/an/a 3n/an/an/an/an/an/a
AstraZeneca
Curated by ChEMBL
Assay Description
Displacement of [3H]-N-(2-fluoro-4-methylsulfonyl-phenyl)-6-[4-(3-isopropyl-1,2,4-oxadiazol-5-yl)-1-piperidyl]-5-nitro-pyrimidin-4-amine from human G...
Bioorg Med Chem Lett 23: 3175-9 (2013)
Article DOI: 10.1016/j.bmcl.2013.04.006
BindingDB Entry DOI: 10.7270/Q25Q4XGC
Glucose-dependent insulinotropic receptor
(Mus musculus)
BDBM50420836
(CHEMBL2086690)
Show SMILES CC(C)c1nc(no1)N1CCN([C@H](C)C1)c1ncc(OCc2ccncc2C#N)cn1 |r|
Show InChI InChI=1S/C21H24N8O2/c1-14(2)19-26-21(27-31-19)28-6-7-29(15(3)12-28)20-24-10-18(11-25-20)30-13-16-4-5-23-9-17(16)8-22/h4-5,9-11,14-15H,6-7,12-13H2,1-3H3/t15-/m1/s1
Reactome pathway
n/an/an/an/a 56n/an/an/an/a
AstraZeneca
Curated by ChEMBL
Assay Description
Agonist activity at mouse GPR119 receptor assessed as increase in cAMP level after 45 mins by HTRF assay
J Med Chem 55: 5361-79 (2012)
Article DOI: 10.1021/jm300310c
BindingDB Entry DOI: 10.7270/Q2PZ5B3V
Potassium voltage-gated channel subfamily H member 2
(Homo sapiens (Human))
BDBM50420836
(CHEMBL2086690)
Show SMILES CC(C)c1nc(no1)N1CCN([C@H](C)C1)c1ncc(OCc2ccncc2C#N)cn1 |r|
Show InChI InChI=1S/C21H24N8O2/c1-14(2)19-26-21(27-31-19)28-6-7-29(15(3)12-28)20-24-10-18(11-25-20)30-13-16-4-5-23-9-17(16)8-22/h4-5,9-11,14-15H,6-7,12-13H2,1-3H3/t15-/m1/s1
Reactome pathway
n/an/a 1.00E+4n/an/an/an/an/an/a
AstraZeneca
Curated by ChEMBL
Assay Description
Inhibition of human hERG
J Med Chem 55: 5361-79 (2012)
Article DOI: 10.1021/jm300310c
BindingDB Entry DOI: 10.7270/Q2PZ5B3V
Glucose-dependent insulinotropic receptor
(Mus musculus)
BDBM50420836
(CHEMBL2086690)
Show SMILES CC(C)c1nc(no1)N1CCN([C@H](C)C1)c1ncc(OCc2ccncc2C#N)cn1 |r|
Show InChI InChI=1S/C21H24N8O2/c1-14(2)19-26-21(27-31-19)28-6-7-29(15(3)12-28)20-24-10-18(11-25-20)30-13-16-4-5-23-9-17(16)8-22/h4-5,9-11,14-15H,6-7,12-13H2,1-3H3/t15-/m1/s1
Reactome pathway
n/an/an/an/a 56n/an/an/an/a
AstraZeneca
Curated by ChEMBL
Assay Description
Agonist activity at mouse GPR119 overexpressed in HEK293S cells assessed as change in cAMP level after 45 mins by HTRF assay
Bioorg Med Chem Lett 23: 3175-9 (2013)
Article DOI: 10.1016/j.bmcl.2013.04.006
BindingDB Entry DOI: 10.7270/Q25Q4XGC
Glucose-dependent insulinotropic receptor
(Homo sapiens (Human))
BDBM50420836
(CHEMBL2086690)
Show SMILES CC(C)c1nc(no1)N1CCN([C@H](C)C1)c1ncc(OCc2ccncc2C#N)cn1 |r|
Show InChI InChI=1S/C21H24N8O2/c1-14(2)19-26-21(27-31-19)28-6-7-29(15(3)12-28)20-24-10-18(11-25-20)30-13-16-4-5-23-9-17(16)8-22/h4-5,9-11,14-15H,6-7,12-13H2,1-3H3/t15-/m1/s1
n/an/an/an/a 8n/an/an/an/a
AstraZeneca
Curated by ChEMBL
Assay Description
Agonist activity at human GPR119 overexpressed in HEK293S cells assessed as change in cAMP level after 45 mins by HTRF assay
Bioorg Med Chem Lett 23: 3175-9 (2013)
Article DOI: 10.1016/j.bmcl.2013.04.006
BindingDB Entry DOI: 10.7270/Q25Q4XGC
Glucose-dependent insulinotropic receptor
(Mus musculus)
BDBM50420836
(CHEMBL2086690)
Show SMILES CC(C)c1nc(no1)N1CCN([C@H](C)C1)c1ncc(OCc2ccncc2C#N)cn1 |r|
Show InChI InChI=1S/C21H24N8O2/c1-14(2)19-26-21(27-31-19)28-6-7-29(15(3)12-28)20-24-10-18(11-25-20)30-13-16-4-5-23-9-17(16)8-22/h4-5,9-11,14-15H,6-7,12-13H2,1-3H3/t15-/m1/s1
Reactome pathway
n/an/a 568n/an/an/an/an/an/a
AstraZeneca
Curated by ChEMBL
Assay Description
Displacement of [3H]-N-(2-fluoro-4-methylsulfonyl-phenyl)-6-[4-(3-isopropyl-1,2,4-oxadiazol-5-yl)-1-piperidyl]-5-nitro-pyrimidin-4-amine from mouse G...
Bioorg Med Chem Lett 23: 3175-9 (2013)
Article DOI: 10.1016/j.bmcl.2013.04.006
BindingDB Entry DOI: 10.7270/Q25Q4XGC
Cytochrome P450 1A2
(Homo sapiens (Human))
BDBM50420836
(CHEMBL2086690)
Show SMILES CC(C)c1nc(no1)N1CCN([C@H](C)C1)c1ncc(OCc2ccncc2C#N)cn1 |r|
Show InChI InChI=1S/C21H24N8O2/c1-14(2)19-26-21(27-31-19)28-6-7-29(15(3)12-28)20-24-10-18(11-25-20)30-13-16-4-5-23-9-17(16)8-22/h4-5,9-11,14-15H,6-7,12-13H2,1-3H3/t15-/m1/s1
Reactome pathway
n/an/a>3.00E+4n/an/an/an/an/an/a
AstraZeneca
Curated by ChEMBL
Assay Description
Inhibition of CYP1A2 by high-throughput fluorescence assay
J Med Chem 55: 5361-79 (2012)
Article DOI: 10.1021/jm300310c
BindingDB Entry DOI: 10.7270/Q2PZ5B3V