BDBM50421089 CHEMBL2088344
SMILES: CC(C)NC(=O)c1ccnc(NC(P(O)(O)=O)P(O)(O)=O)c1
InChI Key: InChIKey=HRVBTHNNRBCOTC-UHFFFAOYSA-N
Data: 1 IC50
Activity Spreadsheet -- Enzyme Inhibition Constant Data from BindingDB
Found 1 hit for monomerid = 50421089
Trg + Lig
Ki
nM
ΔG°
kcal/mole
IC50
nM
Kd
nM
EC50/IC50
nM
koff
s-1
kon
M-1s-1
pHTemp
°C
Farnesyl diphosphate synthase
(Homo sapiens (Human))
BDBM50421089
(CHEMBL2088344)
Show SMILES CC(C)NC(=O)c1ccnc(NC(P(O)(O)=O)P(O)(O)=O)c1
Show InChI InChI=1S/C10H17N3O7P2/c1-6(2)12-9(14)7-3-4-11-8(5-7)13-10(21(15,16)17)22(18,19)20/h3-6,10H,1-2H3,(H,11,13)(H,12,14)(H2,15,16,17)(H2,18,19,20)
Reactome pathway
n/an/a 1.00E+3n/an/an/an/an/an/a
McGill University
Curated by ChEMBL
Assay Description
Inhibition of human His6-tagged recombinant FPPS expressed in Escherichia coli BL21(DE3) using GPP and [3H]IPP as substrate incubated for 5 mins prio...
Bioorg Med Chem 20: 5583-91 (2012)
Article DOI: 10.1016/j.bmc.2012.07.019
BindingDB Entry DOI: 10.7270/Q2J67J6M