BDBM50421133 CHEMBL2088575
SMILES: Fc1ccc(Oc2ccc3c(-c4cc(ccc4C=C)C(=O)NC4CC4)c(=O)ccn3n2)c(F)c1
InChI Key: InChIKey=QULUIOJPUAFNFV-UHFFFAOYSA-N
Data: 2 IC50
Activity Spreadsheet -- Enzyme Inhibition Constant Data from BindingDB
Found 2 hits for monomerid = 50421133
Trg + Lig
Ki
nM
ΔG°
kcal/mole
IC50
nM
Kd
nM
EC50/IC50
nM
koff
s-1
kon
M-1s-1
pHTemp
°C
MAP kinase p38 beta
(Mus musculus (mouse))
BDBM50421133
(CHEMBL2088575)
Show SMILES Fc1ccc(Oc2ccc3c(-c4cc(ccc4C=C)C(=O)NC4CC4)c(=O)ccn3n2)c(F)c1 |(13.19,-41.38,;13.18,-39.84,;11.85,-39.08,;11.84,-37.54,;13.17,-36.77,;13.17,-35.23,;11.83,-34.46,;11.82,-32.92,;10.5,-32.17,;9.18,-32.93,;7.85,-32.17,;7.85,-30.63,;9.18,-29.86,;9.18,-28.31,;7.84,-27.55,;6.52,-28.32,;6.51,-29.86,;5.18,-30.63,;3.85,-29.86,;10.51,-27.54,;10.5,-26,;11.85,-28.3,;13.18,-27.53,;14.72,-27.52,;13.94,-26.19,;6.51,-32.94,;5.18,-32.17,;6.51,-34.48,;7.85,-35.25,;9.18,-34.47,;10.51,-35.23,;14.51,-37.52,;15.84,-36.75,;14.52,-39.06,)|
Show InChI InChI=1S/C26H19F2N3O3/c1-2-15-3-4-16(26(33)29-18-6-7-18)13-19(15)25-21-8-10-24(30-31(21)12-11-22(25)32)34-23-9-5-17(27)14-20(23)28/h2-5,8-14,18H,1,6-7H2,(H,29,33)
Reactome pathway
n/an/a 36n/an/an/an/an/an/a
Merck Research Laboratories
Curated by ChEMBL
Assay Description
Inhibition of mouse p38beta assessed as reduction in GST-ATF2 substrate phosphorylation by SPA assay
Bioorg Med Chem Lett 22: 5979-83 (2012)
Article DOI: 10.1016/j.bmcl.2012.07.035
BindingDB Entry DOI: 10.7270/Q28P61S0
MAP kinase p38
(Mus musculus (mouse))
BDBM50421133
(CHEMBL2088575)
Show SMILES Fc1ccc(Oc2ccc3c(-c4cc(ccc4C=C)C(=O)NC4CC4)c(=O)ccn3n2)c(F)c1 |(13.19,-41.38,;13.18,-39.84,;11.85,-39.08,;11.84,-37.54,;13.17,-36.77,;13.17,-35.23,;11.83,-34.46,;11.82,-32.92,;10.5,-32.17,;9.18,-32.93,;7.85,-32.17,;7.85,-30.63,;9.18,-29.86,;9.18,-28.31,;7.84,-27.55,;6.52,-28.32,;6.51,-29.86,;5.18,-30.63,;3.85,-29.86,;10.51,-27.54,;10.5,-26,;11.85,-28.3,;13.18,-27.53,;14.72,-27.52,;13.94,-26.19,;6.51,-32.94,;5.18,-32.17,;6.51,-34.48,;7.85,-35.25,;9.18,-34.47,;10.51,-35.23,;14.51,-37.52,;15.84,-36.75,;14.52,-39.06,)|
Show InChI InChI=1S/C26H19F2N3O3/c1-2-15-3-4-16(26(33)29-18-6-7-18)13-19(15)25-21-8-10-24(30-31(21)12-11-22(25)32)34-23-9-5-17(27)14-20(23)28/h2-5,8-14,18H,1,6-7H2,(H,29,33)
Reactome pathway
n/an/a 2.30n/an/an/an/an/an/a
Merck Research Laboratories
Curated by ChEMBL
Assay Description
Inhibition of mouse p38apha assessed as reduction in GST-ATF2 substrate phosphorylation by SPA assay
Bioorg Med Chem Lett 22: 5979-83 (2012)
Article DOI: 10.1016/j.bmcl.2012.07.035
BindingDB Entry DOI: 10.7270/Q28P61S0